{"text_format":"1","workbook":"xlsx","n_sheets":5,"sheets":["EM 60 Wurf Damen","EM 60 Wurf Herren 1","EM 60 Wurf Herren 2","Spielerliste","Tabelle1"],"not_rendered":{"charts":0,"images":9,"macros":1,"external_links":0,"defined_names":9,"comments":0,"pivot_tables":0},"unopened":[],"bounds":{"document_bytes":16777216,"sheet_cells":100000,"rows_first":2000,"rows_last":500,"rows_between":2000,"halvings":0,"cell_chars":16384,"cell_head_chars":4096},"cells_cut":0,"cells_raw":0,"read":"whole","date_system":"1900"}

{"sheet":"EM 60 Wurf Damen","index":0,"n_rows":63,"n_cols":42,"rows_kept":63,"cut":false,"hidden":false,"merged":[[0,0,0,15],[1,0,1,15],[3,0,4,0],[3,1,4,1],[3,2,4,2],[3,3,4,3],[3,4,3,7],[3,8,3,11],[3,12,4,12],[3,13,4,13],[3,14,4,14],[3,15,4,15],[3,40,4,40],[3,41,4,41],[0,26,0,41],[1,26,1,41],[3,26,4,26],[3,27,4,27],[3,28,4,28],[3,29,4,29],[3,30,3,33],[3,34,3,37],[3,38,4,38],[3,39,4,39]]}
["60 Wurf - Einzelmeisterschaft  2019/20",null,null,null,null,null,null,null,null,null,null,null,null,null,null,null,null,null,null,null,null,null,null,null,null,null,"Einzelmeisterschaft  2019/20"]
["Ergebnisliste - DAMEN",null,null,null,null,null,null,null,null,null,null,null,null,null,null,null,null,null,null,null,null,null,null,null,null,null,"Ergebnisliste - DAMEN"]
[]
["Pl.",null,"Name","Ortsgr.","1. Durchgang",null,null,null,"2. Durchgang",null,null,null,"Volle","Abr","Ges","FW",null,null,null,null,null,null,null,null,null,null,null,null,"Name","Ortsgr.","1. Durchgang",null,null,null,"2. Durchgang",null,null,null,"Volle","Abr","Ges","FW"]
[null,null,null,null,"V","A","G","FW","V","A","G","FW",null,null,null,null,null,null,null,null,null,null,null,null,null,null,null,null,null,null,"V","A","G","FW","V","A","G","FW"]
[1,331,"Kofler Christine","Dornbirn",88,45,133,0,83,33,116,3,171,78,249,3,null,null,null,null,null,null,null,null,null,null,1,463,{"$f":"IF($AB$6:$AB$29=\"\",\"\",VLOOKUP($AB$6:$AB$29,Spielerliste!$A$1:$C$480,2))","v":"Nussbaumer Anny"},{"$f":"IF($AB$6:$AB$29=\"\",\"\",VLOOKUP($AB$6:$AB$29,Spielerliste!$A$1:$C$480,3))","v":"ESV Br-Wo"},71,{"$f":"AG6-AE6","v":26},97,8,87,{"$f":"AK6-AI6","v":25},112,6,{"$f":"AE6+AI6","v":158},{"$f":"AF6+AJ6","v":51},{"$f":"AG6+AK6","v":209},{"$f":"AH6+AL6","v":14}]
[2,439,"Maier Annemarie","Vandans",82,35,117,2,89,42,131,3,171,77,248,5,null,null,null,null,null,null,null,null,null,null,2,465,{"$f":"IF($AB$6:$AB$29=\"\",\"\",VLOOKUP($AB$6:$AB$29,Spielerliste!$A$1:$C$480,2))","v":"Weinmüller Karin"},{"$f":"IF($AB$6:$AB$29=\"\",\"\",VLOOKUP($AB$6:$AB$29,Spielerliste!$A$1:$C$480,3))","v":"ESV Br-Wo"},77,33,110,4,73,24,97,4,150,57,207,8]
[3,373,"Hämmerle Sabine","Koblach",84,53,137,1,75,35,110,4,159,88,247,5,null,null,null,null,null,null,null,null,null,null,3,387,{"$f":"IF($AB$6:$AB$29=\"\",\"\",VLOOKUP($AB$6:$AB$29,Spielerliste!$A$1:$C$480,2))","v":"Fessler Hildegard"},{"$f":"IF($AB$6:$AB$29=\"\",\"\",VLOOKUP($AB$6:$AB$29,Spielerliste!$A$1:$C$480,3))","v":"Lustenau"},65,35,100,6,71,33,104,2,136,68,204,8]
[4,413,"Müller Hildegard","Nofels",92,26,118,4,94,35,129,3,186,61,247,7,null,null,null,null,null,null,null,null,null,null,4,389,{"$f":"IF($AB$6:$AB$29=\"\",\"\",VLOOKUP($AB$6:$AB$29,Spielerliste!$A$1:$C$480,2))","v":"Loidl Josefine"},{"$f":"IF($AB$6:$AB$29=\"\",\"\",VLOOKUP($AB$6:$AB$29,Spielerliste!$A$1:$C$480,3))","v":"Lustenau"},81,17,98,10,78,17,95,9,159,34,193,19]
[5,324,"Scherrer Luise","Bürs",86,35,121,2,87,35,122,1,173,70,243,3,null,null,null,null,null,null,null,null,null,null,5,391,{"$f":"IF($AB$6:$AB$29=\"\",\"\",VLOOKUP($AB$6:$AB$29,Spielerliste!$A$1:$C$480,2))","v":"Salzmann Elvira"},{"$f":"IF($AB$6:$AB$29=\"\",\"\",VLOOKUP($AB$6:$AB$29,Spielerliste!$A$1:$C$480,3))","v":"Lustenau"},86,18,104,7,79,25,104,5,165,43,208,12]
[6,401,"Lindner Margit","Mäder",79,49,128,2,79,35,114,2,158,84,242,4,null,null,null,null,null,null,null,null,null,null,6,392,{"$f":"IF($AB$6:$AB$29=\"\",\"\",VLOOKUP($AB$6:$AB$29,Spielerliste!$A$1:$C$480,2))","v":"Schelling Hedi"},{"$f":"IF($AB$6:$AB$29=\"\",\"\",VLOOKUP($AB$6:$AB$29,Spielerliste!$A$1:$C$480,3))","v":"Lustenau"},83,25,108,5,79,48,127,0,162,73,235,5]
[7,451,"Gutmann Lore","Wolfurt",76,43,119,1,87,35,122,2,163,78,241,3,null,null,null,null,null,null,null,null,null,null,7,355,{"$f":"IF($AB$6:$AB$29=\"\",\"\",VLOOKUP($AB$6:$AB$29,Spielerliste!$A$1:$C$480,2))","v":"Theiner Elfriede"},{"$f":"IF($AB$6:$AB$29=\"\",\"\",VLOOKUP($AB$6:$AB$29,Spielerliste!$A$1:$C$480,3))","v":"Götzis"},82,35,117,3,77,35,112,3,159,70,229,6]
[8,314,"Schneider Steffi","Bregenz",86,36,122,1,82,34,116,2,168,70,238,3,null,null,null,null,null,null,null,null,null,null,8,354,{"$f":"IF($AB$6:$AB$29=\"\",\"\",VLOOKUP($AB$6:$AB$29,Spielerliste!$A$1:$C$480,2))","v":"Scherz Christine"},{"$f":"IF($AB$6:$AB$29=\"\",\"\",VLOOKUP($AB$6:$AB$29,Spielerliste!$A$1:$C$480,3))","v":"Götzis"},76,27,103,5,76,25,101,6,152,52,204,11]
[9,393,"Stipetic Marija","Lustenau",81,30,111,5,91,34,125,2,172,64,236,7,null,null,null,null,null,null,null,null,null,null,9,352,{"$f":"IF($AB$6:$AB$29=\"\",\"\",VLOOKUP($AB$6:$AB$29,Spielerliste!$A$1:$C$480,2))","v":"Mally Marlene"},{"$f":"IF($AB$6:$AB$29=\"\",\"\",VLOOKUP($AB$6:$AB$29,Spielerliste!$A$1:$C$480,3))","v":"Götzis"},74,42,116,1,72,27,99,4,146,69,215,5]
[10,392,"Schelling Hedi","Lustenau",83,25,108,5,79,48,127,0,162,73,235,5,null,null,null,null,null,null,null,null,null,null,10,472,{"$f":"IF($AB$6:$AB$29=\"\",\"\",VLOOKUP($AB$6:$AB$29,Spielerliste!$A$1:$C$480,2))","v":"Klinger Inge"},{"$f":"IF($AB$6:$AB$29=\"\",\"\",VLOOKUP($AB$6:$AB$29,Spielerliste!$A$1:$C$480,3))","v":"Partenen"},81,34,115,2,56,33,89,4,137,67,204,6]
[11,428,"Gobbi Erika","Rheindelta",85,35,120,3,88,27,115,3,173,62,235,6,null,null,null,null,null,null,null,null,null,null,11,475,{"$f":"IF($AB$6:$AB$29=\"\",\"\",VLOOKUP($AB$6:$AB$29,Spielerliste!$A$1:$C$480,2))","v":"Stemer Marianne"},{"$f":"IF($AB$6:$AB$29=\"\",\"\",VLOOKUP($AB$6:$AB$29,Spielerliste!$A$1:$C$480,3))","v":"Partenen"},67,26,93,5,70,34,104,4,137,60,197,9]
[12,443,"Ströhle Renate","Vandans",82,26,108,5,84,42,126,3,166,68,234,8,null,null,null,null,null,null,null,null,null,null,12,473,{"$f":"IF($AB$6:$AB$29=\"\",\"\",VLOOKUP($AB$6:$AB$29,Spielerliste!$A$1:$C$480,2))","v":"Munz Renate"},{"$f":"IF($AB$6:$AB$29=\"\",\"\",VLOOKUP($AB$6:$AB$29,Spielerliste!$A$1:$C$480,3))","v":"Partenen"},65,26,91,6,73,41,114,1,138,67,205,7]
[13,343,"Speckle Irene","Feldkirch",92,24,116,5,81,36,117,1,173,60,233,6,null,null,null,null,null,null,null,null,null,null,13,471,{"$f":"IF($AB$6:$AB$29=\"\",\"\",VLOOKUP($AB$6:$AB$29,Spielerliste!$A$1:$C$480,2))","v":"Bitschnau Gerti"},{"$f":"IF($AB$6:$AB$29=\"\",\"\",VLOOKUP($AB$6:$AB$29,Spielerliste!$A$1:$C$480,3))","v":"Partenen"},49,9,58,12,75,13,88,9,124,22,146,21]
[14,355,"Theiner Elfriede","Götzis",82,35,117,3,77,35,112,3,159,70,229,6,null,null,null,null,null,null,null,null,null,null,14,436,{"$f":"IF($AB$6:$AB$29=\"\",\"\",VLOOKUP($AB$6:$AB$29,Spielerliste!$A$1:$C$480,2))","v":"Bitschnau Ursula"},{"$f":"IF($AB$6:$AB$29=\"\",\"\",VLOOKUP($AB$6:$AB$29,Spielerliste!$A$1:$C$480,3))","v":"Vandans"},86,26,112,5,73,43,116,3,159,69,228,8]
[15,436,"Bitschnau Ursula","Vandans",86,26,112,5,73,43,116,3,159,69,228,8,null,null,null,null,null,null,null,null,null,null,15,439,{"$f":"IF($AB$6:$AB$29=\"\",\"\",VLOOKUP($AB$6:$AB$29,Spielerliste!$A$1:$C$480,2))","v":"Maier Annemarie"},{"$f":"IF($AB$6:$AB$29=\"\",\"\",VLOOKUP($AB$6:$AB$29,Spielerliste!$A$1:$C$480,3))","v":"Vandans"},82,35,117,2,89,42,131,3,171,77,248,5]
[16,363,"Woinesich Eva","Hard",70,34,104,3,92,32,124,2,162,66,228,5,null,null,null,null,null,null,null,null,null,null,16,441,{"$f":"IF($AB$6:$AB$29=\"\",\"\",VLOOKUP($AB$6:$AB$29,Spielerliste!$A$1:$C$480,2))","v":"Salzgeber  Margret"},{"$f":"IF($AB$6:$AB$29=\"\",\"\",VLOOKUP($AB$6:$AB$29,Spielerliste!$A$1:$C$480,3))","v":"Vandans"},85,27,112,5,68,31,99,5,153,58,211,10]
[17,461,"Kohler Brigitte","ESV Br-Wo",90,34,124,3,79,25,104,4,169,59,228,7,null,null,null,null,null,null,null,null,null,null,17,443,{"$f":"IF($AB$6:$AB$29=\"\",\"\",VLOOKUP($AB$6:$AB$29,Spielerliste!$A$1:$C$480,2))","v":"Ströhle Renate"},{"$f":"IF($AB$6:$AB$29=\"\",\"\",VLOOKUP($AB$6:$AB$29,Spielerliste!$A$1:$C$480,3))","v":"Vandans"},82,26,108,5,84,42,126,3,166,68,234,8]
[18,399,"Hinteregger Steffi","Mäder",85,29,114,5,76,35,111,5,161,64,225,10,null,null,null,null,null,null,null,null,null,null,18,461,{"$f":"IF($AB$6:$AB$29=\"\",\"\",VLOOKUP($AB$6:$AB$29,Spielerliste!$A$1:$C$480,2))","v":"Kohler Brigitte"},{"$f":"IF($AB$6:$AB$29=\"\",\"\",VLOOKUP($AB$6:$AB$29,Spielerliste!$A$1:$C$480,3))","v":"ESV Br-Wo"},90,34,124,3,79,25,104,4,169,59,228,7]
[19,334,"Oblak Heidi","Dornbirn",72,34,106,4,84,34,118,2,156,68,224,6,null,null,null,null,null,null,null,null,null,null,19,341,{"$f":"IF($AB$6:$AB$29=\"\",\"\",VLOOKUP($AB$6:$AB$29,Spielerliste!$A$1:$C$480,2))","v":"Getsch Lotte"},{"$f":"IF($AB$6:$AB$29=\"\",\"\",VLOOKUP($AB$6:$AB$29,Spielerliste!$A$1:$C$480,3))","v":"Feldkirch"},66,25,91,6,79,35,114,3,145,60,205,9]
[20,326,"Witting Magdalena","Bürs",86,33,119,4,79,25,104,5,165,58,223,9,null,null,null,null,null,null,null,null,null,null,20,null,{"$f":"IF($AB$6:$AB$29=\"\",\"\",VLOOKUP($AB$6:$AB$29,Spielerliste!$A$1:$C$480,2))","v":""},{"$f":"IF($AB$6:$AB$29=\"\",\"\",VLOOKUP($AB$6:$AB$29,Spielerliste!$A$1:$C$480,3))","v":""},null,0,null,null,null,0,null,null,0,0,0,0]
[21,333,"Mayr Ernestine","Dornbirn",80,33,113,4,73,35,108,3,153,68,221,7,null,null,null,null,null,null,null,null,null,null,21,null,{"$f":"IF($AB$6:$AB$29=\"\",\"\",VLOOKUP($AB$6:$AB$29,Spielerliste!$A$1:$C$480,2))","v":""},{"$f":"IF($AB$6:$AB$29=\"\",\"\",VLOOKUP($AB$6:$AB$29,Spielerliste!$A$1:$C$480,3))","v":""},null,0,null,null,null,0,null,null,0,0,0,0]
[22,412,"Mair Wilma","Nofels",74,25,99,7,94,25,119,6,168,50,218,13,null,null,null,null,null,null,null,null,null,null,22,397,{"$f":"IF($AB$6:$AB$29=\"\",\"\",VLOOKUP($AB$6:$AB$29,Spielerliste!$A$1:$C$480,2))","v":"Ebenhoch Monika"},{"$f":"IF($AB$6:$AB$29=\"\",\"\",VLOOKUP($AB$6:$AB$29,Spielerliste!$A$1:$C$480,3))","v":"Mäder"},73,34,107,2,73,35,108,3,146,69,215,5]
[23,402,"Stiegler Silvia","Mäder",78,27,105,5,75,36,111,4,153,63,216,9,null,null,null,null,null,null,null,null,null,null,23,399,{"$f":"IF($AB$6:$AB$29=\"\",\"\",VLOOKUP($AB$6:$AB$29,Spielerliste!$A$1:$C$480,2))","v":"Hinteregger Steffi"},{"$f":"IF($AB$6:$AB$29=\"\",\"\",VLOOKUP($AB$6:$AB$29,Spielerliste!$A$1:$C$480,3))","v":"Mäder"},85,29,114,5,76,35,111,5,161,64,225,10]
[24,352,"Mally Marlene","Götzis",74,42,116,1,72,27,99,4,146,69,215,5,null,null,null,null,null,null,null,null,null,null,24,401,{"$f":"IF($AB$6:$AB$51=\"\",\"\",VLOOKUP($AB$6:$AB$51,Spielerliste!$A$1:$C$480,2))","v":"Lindner Margit"},{"$f":"IF($AB$6:$AB$51=\"\",\"\",VLOOKUP($AB$6:$AB$51,Spielerliste!$A$1:$C$480,3))","v":"Mäder"},79,49,128,2,79,35,114,2,158,84,242,4]
[25,397,"Ebenhoch Monika","Mäder",73,34,107,2,73,35,108,3,146,69,215,5,null,null,null,null,null,null,null,null,null,null,25,402,{"$f":"IF($AB$6:$AB$51=\"\",\"\",VLOOKUP($AB$6:$AB$51,Spielerliste!$A$1:$C$480,2))","v":"Stiegler Silvia"},{"$f":"IF($AB$6:$AB$51=\"\",\"\",VLOOKUP($AB$6:$AB$51,Spielerliste!$A$1:$C$480,3))","v":"Mäder"},78,27,105,5,75,36,111,4,153,63,216,9]
[26,337,"Seidler Elisabeth","Dornbirn",78,33,111,2,69,34,103,6,147,67,214,8,null,null,null,null,null,null,null,null,null,null,26,403,{"$f":"IF($AB$6:$AB$51=\"\",\"\",VLOOKUP($AB$6:$AB$51,Spielerliste!$A$1:$C$480,2))","v":"Stracker Anna"},{"$f":"IF($AB$6:$AB$51=\"\",\"\",VLOOKUP($AB$6:$AB$51,Spielerliste!$A$1:$C$480,3))","v":"Mäder"},81,18,99,9,80,18,98,7,161,36,197,16]
[27,452,"Lick Brunhilde","Wolfurt",63,45,108,1,78,27,105,6,141,72,213,7,null,null,null,null,null,null,null,null,null,null,27,322,{"$f":"IF($AB$6:$AB$51=\"\",\"\",VLOOKUP($AB$6:$AB$51,Spielerliste!$A$1:$C$480,2))","v":"Leimgruber Roswitha"},{"$f":"IF($AB$6:$AB$51=\"\",\"\",VLOOKUP($AB$6:$AB$51,Spielerliste!$A$1:$C$480,3))","v":"Bürs"},84,24,108,4,60,17,77,6,144,41,185,10]
[28,431,"Stückler Hermi","Rheindelta",70,31,101,6,85,26,111,6,155,57,212,12,null,null,null,null,null,null,null,null,null,null,28,326,{"$f":"IF($AB$6:$AB$51=\"\",\"\",VLOOKUP($AB$6:$AB$51,Spielerliste!$A$1:$C$480,2))","v":"Witting Magdalena"},{"$f":"IF($AB$6:$AB$51=\"\",\"\",VLOOKUP($AB$6:$AB$51,Spielerliste!$A$1:$C$480,3))","v":"Bürs"},86,33,119,4,79,25,104,5,165,58,223,9]
[29,442,"Sinko Lotte","Vandans",82,33,115,1,70,26,96,7,152,59,211,8,null,null,null,null,null,null,null,null,null,null,29,324,{"$f":"IF($AB$6:$AB$51=\"\",\"\",VLOOKUP($AB$6:$AB$51,Spielerliste!$A$1:$C$480,2))","v":"Scherrer Luise"},{"$f":"IF($AB$6:$AB$51=\"\",\"\",VLOOKUP($AB$6:$AB$51,Spielerliste!$A$1:$C$480,3))","v":"Bürs"},86,35,121,2,87,35,122,1,173,70,243,3]
[30,321,"Hepberger Monika","Bürs",64,27,91,3,88,32,120,6,152,59,211,9,null,null,null,null,null,null,null,null,null,null,30,321,{"$f":"IF($AB$6:$AB$51=\"\",\"\",VLOOKUP($AB$6:$AB$51,Spielerliste!$A$1:$C$480,2))","v":"Hepberger Monika"},{"$f":"IF($AB$6:$AB$51=\"\",\"\",VLOOKUP($AB$6:$AB$51,Spielerliste!$A$1:$C$480,3))","v":"Bürs"},64,27,91,3,88,32,120,6,152,59,211,9]
[31,441,"Salzgeber  Margret","Vandans",85,27,112,5,68,31,99,5,153,58,211,10,null,null,null,null,null,null,null,null,null,null,31,323,{"$f":"IF($AB$6:$AB$51=\"\",\"\",VLOOKUP($AB$6:$AB$51,Spielerliste!$A$1:$C$480,2))","v":"Pfeifer Gertrud"},{"$f":"IF($AB$6:$AB$51=\"\",\"\",VLOOKUP($AB$6:$AB$51,Spielerliste!$A$1:$C$480,3))","v":"Bürs"},57,20,77,7,68,32,100,6,125,52,177,13]
[32,463,"Nussbaumer Anny","ESV Br-Wo",71,26,97,8,87,25,112,6,158,51,209,14,null,null,null,null,null,null,null,null,null,null,32,325,{"$f":"IF($AB$6:$AB$51=\"\",\"\",VLOOKUP($AB$6:$AB$51,Spielerliste!$A$1:$C$480,2))","v":"Stadlmayr Yvonne"},{"$f":"IF($AB$6:$AB$51=\"\",\"\",VLOOKUP($AB$6:$AB$51,Spielerliste!$A$1:$C$480,3))","v":"Bürs"},49,44,93,3,65,16,81,8,114,60,174,11]
[33,427,"Car Herta","Rheindelta",80,18,98,8,76,34,110,1,156,52,208,9,null,null,null,null,null,null,null,null,null,null,33,431,{"$f":"IF($AB$6:$AB$51=\"\",\"\",VLOOKUP($AB$6:$AB$51,Spielerliste!$A$1:$C$480,2))","v":"Stückler Hermi"},{"$f":"IF($AB$6:$AB$51=\"\",\"\",VLOOKUP($AB$6:$AB$51,Spielerliste!$A$1:$C$480,3))","v":"Rheindelta"},70,31,101,6,85,26,111,6,155,57,212,12]
[34,361,"Di-Meglio Gerda","Hard",79,26,105,4,79,24,103,6,158,50,208,10,null,null,null,null,null,null,null,null,null,null,34,null,{"$f":"IF($AB$6:$AB$51=\"\",\"\",VLOOKUP($AB$6:$AB$51,Spielerliste!$A$1:$C$480,2))","v":""},{"$f":"IF($AB$6:$AB$51=\"\",\"\",VLOOKUP($AB$6:$AB$51,Spielerliste!$A$1:$C$480,3))","v":""},null,0,null,null,null,0,null,null,0,0,0,0]
[35,391,"Salzmann Elvira","Lustenau",86,18,104,7,79,25,104,5,165,43,208,12,null,null,null,null,null,null,null,null,null,null,35,343,{"$f":"IF($AB$6:$AB$51=\"\",\"\",VLOOKUP($AB$6:$AB$51,Spielerliste!$A$1:$C$480,2))","v":"Speckle Irene"},{"$f":"IF($AB$6:$AB$51=\"\",\"\",VLOOKUP($AB$6:$AB$51,Spielerliste!$A$1:$C$480,3))","v":"Feldkirch"},92,24,116,5,81,36,117,1,173,60,233,6]
[36,353,"Schatzmann Doris","Götzis",74,31,105,4,75,27,102,5,149,58,207,9,null,null,null,null,null,null,null,null,null,null,36,430,{"$f":"IF($AB$6:$AB$51=\"\",\"\",VLOOKUP($AB$6:$AB$51,Spielerliste!$A$1:$C$480,2))","v":"Schobel Monika"},{"$f":"IF($AB$6:$AB$51=\"\",\"\",VLOOKUP($AB$6:$AB$51,Spielerliste!$A$1:$C$480,3))","v":"Rheindelta"},72,18,90,6,75,17,92,6,147,35,182,12]
[37,465,"Weinmüller Karin","ESV Br-Wo",77,33,110,4,73,24,97,4,150,57,207,8,null,null,null,null,null,null,null,null,null,null,37,428,{"$f":"IF($AB$6:$AB$51=\"\",\"\",VLOOKUP($AB$6:$AB$51,Spielerliste!$A$1:$C$480,2))","v":"Gobbi Erika"},{"$f":"IF($AB$6:$AB$51=\"\",\"\",VLOOKUP($AB$6:$AB$51,Spielerliste!$A$1:$C$480,3))","v":"Rheindelta"},85,35,120,3,88,27,115,3,173,62,235,6]
[38,332,"Kuncic Eleonora","Dornbirn",81,15,96,9,76,35,111,4,157,50,207,13,null,null,null,null,null,null,null,null,null,null,38,427,{"$f":"IF($AB$6:$AB$51=\"\",\"\",VLOOKUP($AB$6:$AB$51,Spielerliste!$A$1:$C$480,2))","v":"Car Herta"},{"$f":"IF($AB$6:$AB$51=\"\",\"\",VLOOKUP($AB$6:$AB$51,Spielerliste!$A$1:$C$480,3))","v":"Rheindelta"},80,18,98,8,76,34,110,1,156,52,208,9]
[39,473,"Munz Renate","Partenen",65,26,91,6,73,41,114,1,138,67,205,7,null,null,null,null,null,null,null,null,null,null,39,426,{"$f":"IF($AB$6:$AB$51=\"\",\"\",VLOOKUP($AB$6:$AB$51,Spielerliste!$A$1:$C$480,2))","v":"Bernard Hilde"},{"$f":"IF($AB$6:$AB$51=\"\",\"\",VLOOKUP($AB$6:$AB$51,Spielerliste!$A$1:$C$480,3))","v":"Rheindelta"},51,19,70,9,67,30,97,6,118,49,167,15]
[40,341,"Getsch Lotte","Feldkirch",66,25,91,6,79,35,114,3,145,60,205,9,null,null,null,null,null,null,null,null,null,null,40,361,{"$f":"IF($AB$6:$AB$51=\"\",\"\",VLOOKUP($AB$6:$AB$51,Spielerliste!$A$1:$C$480,2))","v":"Di-Meglio Gerda"},{"$f":"IF($AB$6:$AB$51=\"\",\"\",VLOOKUP($AB$6:$AB$51,Spielerliste!$A$1:$C$480,3))","v":"Hard"},79,26,105,4,79,24,103,6,158,50,208,10]
[41,387,"Fessler Hildegard","Lustenau",65,35,100,6,71,33,104,2,136,68,204,8,null,null,null,null,null,null,null,null,null,null,41,421,{"$f":"IF($AB$6:$AB$51=\"\",\"\",VLOOKUP($AB$6:$AB$51,Spielerliste!$A$1:$C$480,2))","v":"Knobel Herlinde"},{"$f":"IF($AB$6:$AB$51=\"\",\"\",VLOOKUP($AB$6:$AB$51,Spielerliste!$A$1:$C$480,3))","v":"Rankweil"},77,27,104,4,65,14,79,9,142,41,183,13]
[42,472,"Klinger Inge","Partenen",81,34,115,2,56,33,89,4,137,67,204,6,null,null,null,null,null,null,null,null,null,null,42,413,{"$f":"IF($AB$6:$AB$51=\"\",\"\",VLOOKUP($AB$6:$AB$51,Spielerliste!$A$1:$C$480,2))","v":"Müller Hildegard"},{"$f":"IF($AB$6:$AB$51=\"\",\"\",VLOOKUP($AB$6:$AB$51,Spielerliste!$A$1:$C$480,3))","v":"Nofels"},92,26,118,4,94,35,129,3,186,61,247,7]
[43,354,"Scherz Christine","Götzis",76,27,103,5,76,25,101,6,152,52,204,11,null,null,null,null,null,null,null,null,null,null,43,412,{"$f":"IF($AB$6:$AB$51=\"\",\"\",VLOOKUP($AB$6:$AB$51,Spielerliste!$A$1:$C$480,2))","v":"Mair Wilma"},{"$f":"IF($AB$6:$AB$51=\"\",\"\",VLOOKUP($AB$6:$AB$51,Spielerliste!$A$1:$C$480,3))","v":"Nofels"},74,25,99,7,94,25,119,6,168,50,218,13]
[44,429,"Nedok Manuela","Rheindelta",82,24,106,5,70,26,96,7,152,50,202,12,null,null,null,null,null,null,null,null,null,null,44,388,{"$f":"IF($AB$6:$AB$51=\"\",\"\",VLOOKUP($AB$6:$AB$51,Spielerliste!$A$1:$C$480,2))","v":"Isele Heidi"},{"$f":"IF($AB$6:$AB$51=\"\",\"\",VLOOKUP($AB$6:$AB$51,Spielerliste!$A$1:$C$480,3))","v":"Lustenau"},57,23,80,7,62,25,87,10,119,48,167,17]
[45,475,"Stemer Marianne","Partenen",67,26,93,5,70,34,104,4,137,60,197,9,null,null,null,null,null,null,null,null,null,null,45,393,{"$f":"IF($AB$6:$AB$51=\"\",\"\",VLOOKUP($AB$6:$AB$51,Spielerliste!$A$1:$C$480,2))","v":"Stipetic Marija"},{"$f":"IF($AB$6:$AB$51=\"\",\"\",VLOOKUP($AB$6:$AB$51,Spielerliste!$A$1:$C$480,3))","v":"Lustenau"},81,{"$f":"AG50-AE50","v":30},111,5,91,{"$f":"AK50-AI50","v":34},125,2,{"$f":"AE50+AI50","v":172},{"$f":"AF50+AJ50","v":64},{"$f":"AG50+AK50","v":236},{"$f":"AH50+AL50","v":7}]
[46,403,"Stracker Anna","Mäder",81,18,99,9,80,18,98,7,161,36,197,16,null,null,null,null,null,null,null,null,null,null,46,363,{"$f":"IF($AB$6:$AB$67=\"\",\"\",VLOOKUP($AB$6:$AB$67,Spielerliste!$A$1:$C$480,2))","v":"Woinesich Eva"},{"$f":"IF($AB$6:$AB$67=\"\",\"\",VLOOKUP($AB$6:$AB$67,Spielerliste!$A$1:$C$480,3))","v":"Hard"},70,34,104,3,92,32,124,2,162,66,228,5]
[47,389,"Loidl Josefine","Lustenau",81,17,98,10,78,17,95,9,159,34,193,19,null,null,null,null,null,null,null,null,null,null,47,451,{"$f":"IF($AB$6:$AB$67=\"\",\"\",VLOOKUP($AB$6:$AB$67,Spielerliste!$A$1:$C$480,2))","v":"Gutmann Lore"},{"$f":"IF($AB$6:$AB$67=\"\",\"\",VLOOKUP($AB$6:$AB$67,Spielerliste!$A$1:$C$480,3))","v":"Wolfurt"},76,{"$f":"AG52-AE52","v":43},119,1,87,{"$f":"AK52-AI52","v":35},122,2,{"$f":"AE52+AI52","v":163},{"$f":"AF52+AJ52","v":78},{"$f":"AG52+AK52","v":241},{"$f":"AH52+AL52","v":3}]
[48,322,"Leimgruber Roswitha","Bürs",84,24,108,4,60,17,77,6,144,41,185,10,null,null,null,null,null,null,null,null,null,null,48,452,{"$f":"IF($AB$6:$AB$67=\"\",\"\",VLOOKUP($AB$6:$AB$67,Spielerliste!$A$1:$C$480,2))","v":"Lick Brunhilde"},{"$f":"IF($AB$6:$AB$67=\"\",\"\",VLOOKUP($AB$6:$AB$67,Spielerliste!$A$1:$C$480,3))","v":"Wolfurt"},63,45,108,1,78,27,105,6,141,72,213,7]
[49,421,"Knobel Herlinde","Rankweil",77,27,104,4,65,14,79,9,142,41,183,13,null,null,null,null,null,null,null,null,null,null,49,429,{"$f":"IF($AB$6:$AB$67=\"\",\"\",VLOOKUP($AB$6:$AB$67,Spielerliste!$A$1:$C$480,2))","v":"Nedok Manuela"},{"$f":"IF($AB$6:$AB$67=\"\",\"\",VLOOKUP($AB$6:$AB$67,Spielerliste!$A$1:$C$480,3))","v":"Rheindelta"},82,24,106,5,70,26,96,7,152,50,202,12]
[50,430,"Schobel Monika","Rheindelta",72,18,90,6,75,17,92,6,147,35,182,12,null,null,null,null,null,null,null,null,null,null,50,442,{"$f":"IF($AB$6:$AB$67=\"\",\"\",VLOOKUP($AB$6:$AB$67,Spielerliste!$A$1:$C$480,2))","v":"Sinko Lotte"},{"$f":"IF($AB$6:$AB$67=\"\",\"\",VLOOKUP($AB$6:$AB$67,Spielerliste!$A$1:$C$480,3))","v":"Vandans"},82,{"$f":"AG55-AE55","v":33},115,1,70,{"$f":"AK55-AI55","v":26},96,7,{"$f":"AE55+AI55","v":152},{"$f":"AF55+AJ55","v":59},{"$f":"AG55+AK55","v":211},{"$f":"AH55+AL55","v":8}]
[51,323,"Pfeifer Gertrud","Bürs",57,20,77,7,68,32,100,6,125,52,177,13,null,null,null,null,null,null,null,null,null,null,51,353,{"$f":"IF($AB$6:$AB$67=\"\",\"\",VLOOKUP($AB$6:$AB$67,Spielerliste!$A$1:$C$480,2))","v":"Schatzmann Doris"},{"$f":"IF($AB$6:$AB$67=\"\",\"\",VLOOKUP($AB$6:$AB$67,Spielerliste!$A$1:$C$480,3))","v":"Götzis"},74,31,105,4,75,27,102,5,149,58,207,9]
[52,325,"Stadlmayr Yvonne","Bürs",49,44,93,3,65,16,81,8,114,60,174,11,null,null,null,null,null,null,null,null,null,null,52,314,{"$f":"IF($AB$6:$AB$67=\"\",\"\",VLOOKUP($AB$6:$AB$67,Spielerliste!$A$1:$C$480,2))","v":"Schneider Steffi"},{"$f":"IF($AB$6:$AB$67=\"\",\"\",VLOOKUP($AB$6:$AB$67,Spielerliste!$A$1:$C$480,3))","v":"Bregenz"},86,36,122,1,82,34,116,2,168,70,238,3]
[53,426,"Bernard Hilde","Rheindelta",51,19,70,9,67,30,97,6,118,49,167,15,null,null,null,null,null,null,null,null,null,null,53,331,{"$f":"IF($AB$6:$AB$67=\"\",\"\",VLOOKUP($AB$6:$AB$67,Spielerliste!$A$1:$C$480,2))","v":"Kofler Christine"},{"$f":"IF($AB$6:$AB$67=\"\",\"\",VLOOKUP($AB$6:$AB$67,Spielerliste!$A$1:$C$480,3))","v":"Dornbirn"},88,45,133,0,83,33,116,3,171,78,249,3]
[54,388,"Isele Heidi","Lustenau",57,23,80,7,62,25,87,10,119,48,167,17,null,null,null,null,null,null,null,null,null,null,54,332,{"$f":"IF($AB$6:$AB$67=\"\",\"\",VLOOKUP($AB$6:$AB$67,Spielerliste!$A$1:$C$480,2))","v":"Kuncic Eleonora"},{"$f":"IF($AB$6:$AB$67=\"\",\"\",VLOOKUP($AB$6:$AB$67,Spielerliste!$A$1:$C$480,3))","v":"Dornbirn"},81,15,96,9,76,35,111,4,157,50,207,13]
[55,471,"Bitschnau Gerti","Partenen",49,9,58,12,75,13,88,9,124,22,146,21,null,null,null,null,null,null,null,null,null,null,55,333,{"$f":"IF($AB$6:$AB$67=\"\",\"\",VLOOKUP($AB$6:$AB$67,Spielerliste!$A$1:$C$480,2))","v":"Mayr Ernestine"},{"$f":"IF($AB$6:$AB$67=\"\",\"\",VLOOKUP($AB$6:$AB$67,Spielerliste!$A$1:$C$480,3))","v":"Dornbirn"},80,33,113,4,73,35,108,3,153,68,221,7]
[null,null,"","",null,null,null,null,null,null,null,null,null,null,null,null,null,null,null,null,null,null,null,null,null,null,56,334,{"$f":"IF($AB$6:$AB$67=\"\",\"\",VLOOKUP($AB$6:$AB$67,Spielerliste!$A$1:$C$480,2))","v":"Oblak Heidi"},{"$f":"IF($AB$6:$AB$67=\"\",\"\",VLOOKUP($AB$6:$AB$67,Spielerliste!$A$1:$C$480,3))","v":"Dornbirn"},72,34,106,4,84,34,118,2,156,68,224,6]
[null,null,"","",null,null,null,null,null,null,null,null,null,null,null,null,null,null,null,null,null,null,null,null,null,null,57,337,{"$f":"IF($AB$6:$AB$67=\"\",\"\",VLOOKUP($AB$6:$AB$67,Spielerliste!$A$1:$C$480,2))","v":"Seidler Elisabeth"},{"$f":"IF($AB$6:$AB$67=\"\",\"\",VLOOKUP($AB$6:$AB$67,Spielerliste!$A$1:$C$480,3))","v":"Dornbirn"},78,33,111,2,69,34,103,6,147,67,214,8]
[null,null,"","",null,null,null,null,null,null,null,null,null,null,null,null,null,null,null,null,null,null,null,null,null,null,58,373,{"$f":"IF($AB$6:$AB$67=\"\",\"\",VLOOKUP($AB$6:$AB$67,Spielerliste!$A$1:$C$480,2))","v":"Hämmerle Sabine"},{"$f":"IF($AB$6:$AB$67=\"\",\"\",VLOOKUP($AB$6:$AB$67,Spielerliste!$A$1:$C$480,3))","v":"Koblach"},84,53,137,1,75,35,110,4,159,88,247,5]

{"sheet":"EM 60 Wurf Herren 1","index":1,"n_rows":60,"n_cols":42,"rows_kept":60,"cut":false,"hidden":false,"merged":[[3,3,4,3],[3,4,3,7],[3,8,3,11],[3,12,4,12],[0,0,0,15],[1,0,1,15],[3,0,4,0],[3,1,4,1],[3,2,4,2],[3,13,4,13],[3,14,4,14],[3,15,4,15],[3,40,4,40],[3,41,4,41],[0,26,0,41],[1,26,1,41],[3,26,4,26],[3,27,4,27],[3,28,4,28],[3,29,4,29],[3,30,3,33],[3,34,3,37],[3,38,4,38],[3,39,4,39]]}
["60 Wurf - Einzelmeisterschaft  2019/20",null,null,null,null,null,null,null,null,null,null,null,null,null,null,null,null,null,null,null,null,null,null,null,null,null,"Einzelmeisterschaft  2019/20"]
["Ergebnisliste - HERREN 1",null,null,null,null,null,null,null,null,null,null,null,null,null,null,null,null,null,null,null,null,null,null,null,null,null,"Ergebnisliste - HERREN 1"]
[]
["Pl.",null,"Name","Ortsgr.","1. Durchgang",null,null,null,"2. Durchgang",null,null,null,"Volle","Abr.","Ges.","FW",null,null,null,null,null,null,null,null,null,null,null,null,"Name","Ortsgr.","1. Durchgang",null,null,null,"2. Durchgang",null,null,null,"Volle","Abr.","Ges.","FW"]
[null,null,null,null,"V","A","G","FW","V","A","G","FW",null,null,null,null,null,null,null,null,null,null,null,null,null,null,null,null,null,null,"V","A","G","FW","V","A","G","FW"]
[1,136,"Grassmugg Josef","Koblach",86,53,139,0,95,51,146,0,181,104,285,0,null,null,null,null,null,null,null,null,null,null,1,184,{"$f":"IF($AB$6:$AB$81=\"\",\"\",VLOOKUP($AB$6:$AB$81,Spielerliste!$A$1:$C$480,2))","v":"Heinle Otmar"},{"$f":"IF($AB$6:$AB$81=\"\",\"\",VLOOKUP($AB$6:$AB$81,Spielerliste!$A$1:$C$480,3))","v":"Mäder"},54,{"$f":"AG6-AE6","v":35},89,8,67,{"$f":"AK6-AI6","v":25},92,6,{"$f":"AE6+AI6","v":121},{"$f":"AF6+AJ6","v":60},{"$f":"AG6+AK6","v":181},{"$f":"AH6+AL6","v":14}]
[2,111,"Cuk Jure","Hohenems",95,53,148,0,87,36,123,3,182,89,271,3,null,null,null,null,null,null,null,null,null,null,2,188,{"$f":"IF($AB$6:$AB$81=\"\",\"\",VLOOKUP($AB$6:$AB$81,Spielerliste!$A$1:$C$480,2))","v":"Riedmann Wolfgang"},{"$f":"IF($AB$6:$AB$81=\"\",\"\",VLOOKUP($AB$6:$AB$81,Spielerliste!$A$1:$C$480,3))","v":"Mäder"},71,26,97,6,78,52,130,0,149,78,227,6]
[3,174,"Riedmann Werner","Lustenau",91,43,134,4,91,45,136,0,182,88,270,4,null,null,null,null,null,null,null,null,null,null,3,85,{"$f":"IF($AB$6:$AB$81=\"\",\"\",VLOOKUP($AB$6:$AB$81,Spielerliste!$A$1:$C$480,2))","v":"Hyden Walter"},{"$f":"IF($AB$6:$AB$81=\"\",\"\",VLOOKUP($AB$6:$AB$81,Spielerliste!$A$1:$C$480,3))","v":"Götzis"},87,27,114,4,87,41,128,1,174,68,242,5]
[4,146,"Nikolic Milosav","Koblach",91,44,135,1,86,44,130,2,177,88,265,3,null,null,null,null,null,null,null,null,null,null,4,90,{"$f":"IF($AB$6:$AB$81=\"\",\"\",VLOOKUP($AB$6:$AB$81,Spielerliste!$A$1:$C$480,2))","v":"Scherz Ernst"},{"$f":"IF($AB$6:$AB$81=\"\",\"\",VLOOKUP($AB$6:$AB$81,Spielerliste!$A$1:$C$480,3))","v":"Götzis"},86,25,111,7,77,35,112,5,163,60,223,12]
[5,46,"Kessler Günter","Dornbirn",87,36,123,2,87,51,138,2,174,87,261,4,null,null,null,null,null,null,null,null,null,null,5,292,{"$f":"IF($AB$6:$AB$81=\"\",\"\",VLOOKUP($AB$6:$AB$81,Spielerliste!$A$1:$C$480,2))","v":"Munz Karl"},{"$f":"IF($AB$6:$AB$81=\"\",\"\",VLOOKUP($AB$6:$AB$81,Spielerliste!$A$1:$C$480,3))","v":"Partenen"},70,17,87,6,79,25,104,5,149,42,191,11]
[6,87,"Pürstl Richard","Götzis",94,42,136,1,87,35,122,3,181,77,258,4,null,null,null,null,null,null,null,null,null,null,6,294,{"$f":"IF($AB$6:$AB$81=\"\",\"\",VLOOKUP($AB$6:$AB$81,Spielerliste!$A$1:$C$480,2))","v":"Werle Karl"},{"$f":"IF($AB$6:$AB$81=\"\",\"\",VLOOKUP($AB$6:$AB$81,Spielerliste!$A$1:$C$480,3))","v":"Partenen"},83,27,110,4,79,26,105,5,162,53,215,9]
[7,43,"Gradwohl Josef","Dornbirn",86,34,120,2,101,36,137,1,187,70,257,3,null,null,null,null,null,null,null,null,null,null,7,111,{"$f":"IF($AB$6:$AB$81=\"\",\"\",VLOOKUP($AB$6:$AB$81,Spielerliste!$A$1:$C$480,2))","v":"Cuk Jure"},{"$f":"IF($AB$6:$AB$81=\"\",\"\",VLOOKUP($AB$6:$AB$81,Spielerliste!$A$1:$C$480,3))","v":"Hohenems"},95,53,148,0,87,36,123,3,182,89,271,3]
[8,220,"Schirgi Wolfgang","Rankweil",80,61,141,2,81,34,115,2,161,95,256,4,null,null,null,null,null,null,null,null,null,null,8,134,{"$f":"IF($AB$6:$AB$81=\"\",\"\",VLOOKUP($AB$6:$AB$81,Spielerliste!$A$1:$C$480,2))","v":"Fessler Gerd"},{"$f":"IF($AB$6:$AB$81=\"\",\"\",VLOOKUP($AB$6:$AB$81,Spielerliste!$A$1:$C$480,3))","v":"Koblach"},92,35,127,1,93,35,128,0,185,70,255,1]
[9,199,"Paulitsch Gottfried","Nofels",87,33,120,3,86,50,136,0,173,83,256,3,null,null,null,null,null,null,null,null,null,null,9,136,{"$f":"IF($AB$6:$AB$81=\"\",\"\",VLOOKUP($AB$6:$AB$81,Spielerliste!$A$1:$C$480,2))","v":"Grassmugg Josef"},{"$f":"IF($AB$6:$AB$81=\"\",\"\",VLOOKUP($AB$6:$AB$81,Spielerliste!$A$1:$C$480,3))","v":"Koblach"},86,53,139,0,95,51,146,0,181,104,285,0]
[10,134,"Fessler Gerd","Koblach",92,35,127,1,93,35,128,0,185,70,255,1,null,null,null,null,null,null,null,null,null,null,10,252,{"$f":"IF($AB$6:$AB$81=\"\",\"\",VLOOKUP($AB$6:$AB$81,Spielerliste!$A$1:$C$480,2))","v":"Maier Wilfried"},{"$f":"IF($AB$6:$AB$81=\"\",\"\",VLOOKUP($AB$6:$AB$81,Spielerliste!$A$1:$C$480,3))","v":"Vandans"},77,27,104,4,88,50,138,0,165,77,242,4]
[11,82,"Einwaller Harald","Götzis",82,41,123,0,89,42,131,0,171,83,254,0,null,null,null,null,null,null,null,null,null,null,11,38,{"$f":"IF($AB$6:$AB$81=\"\",\"\",VLOOKUP($AB$6:$AB$81,Spielerliste!$A$1:$C$480,2))","v":"Berger Reinhard"},{"$f":"IF($AB$6:$AB$81=\"\",\"\",VLOOKUP($AB$6:$AB$81,Spielerliste!$A$1:$C$480,3))","v":"Dornbirn"},85,26,111,3,84,52,136,1,169,78,247,4]
[12,200,"Peterlunger Valerian","Nofels",81,44,125,1,84,43,127,2,165,87,252,3,null,null,null,null,null,null,null,null,null,null,12,256,{"$f":"IF($AB$6:$AB$81=\"\",\"\",VLOOKUP($AB$6:$AB$81,Spielerliste!$A$1:$C$480,2))","v":"Simenowskyj Stefan"},{"$f":"IF($AB$6:$AB$81=\"\",\"\",VLOOKUP($AB$6:$AB$81,Spielerliste!$A$1:$C$480,3))","v":"Vandans"},67,34,101,4,75,42,117,3,142,76,218,7]
[13,47,"Kezic Blago","Dornbirn",92,35,127,2,82,42,124,2,174,77,251,4,null,null,null,null,null,null,null,null,null,null,13,258,{"$f":"IF($AB$6:$AB$81=\"\",\"\",VLOOKUP($AB$6:$AB$81,Spielerliste!$A$1:$C$480,2))","v":"Ströhle Helmut"},{"$f":"IF($AB$6:$AB$81=\"\",\"\",VLOOKUP($AB$6:$AB$81,Spielerliste!$A$1:$C$480,3))","v":"Vandans"},88,26,114,3,79,27,106,1,167,53,220,4]
[14,198,"Mair Otmar","Nofels",87,34,121,2,94,35,129,2,181,69,250,4,null,null,null,null,null,null,null,null,null,null,14,259,{"$f":"IF($AB$6:$AB$81=\"\",\"\",VLOOKUP($AB$6:$AB$81,Spielerliste!$A$1:$C$480,2))","v":"Trummer Heinz"},{"$f":"IF($AB$6:$AB$81=\"\",\"\",VLOOKUP($AB$6:$AB$81,Spielerliste!$A$1:$C$480,3))","v":"Vandans"},71,35,106,5,75,25,100,7,146,60,206,12]
[15,38,"Berger Reinhard","Dornbirn",85,26,111,3,84,52,136,1,169,78,247,4,null,null,null,null,null,null,null,null,null,null,15,261,{"$f":"IF($AB$6:$AB$81=\"\",\"\",VLOOKUP($AB$6:$AB$81,Spielerliste!$A$1:$C$480,2))","v":"Wachter Robert"},{"$f":"IF($AB$6:$AB$81=\"\",\"\",VLOOKUP($AB$6:$AB$81,Spielerliste!$A$1:$C$480,3))","v":"Vandans"},100,25,125,5,63,26,89,5,163,51,214,10]
[16,54,"Vauce Gottfried","Dornbirn",99,34,133,2,79,35,114,2,178,69,247,4,null,null,null,null,null,null,null,null,null,null,16,282,{"$f":"IF($AB$6:$AB$81=\"\",\"\",VLOOKUP($AB$6:$AB$81,Spielerliste!$A$1:$C$480,2))","v":"Marinz Günther"},{"$f":"IF($AB$6:$AB$81=\"\",\"\",VLOOKUP($AB$6:$AB$81,Spielerliste!$A$1:$C$480,3))","v":"ESV Br-Wo"},87,34,121,4,83,42,125,4,170,76,246,8]
[17,151,"Tusch Norbert","Koblach",81,34,115,3,82,49,131,1,163,83,246,4,null,null,null,null,null,null,null,null,null,null,17,283,{"$f":"IF($AB$6:$AB$81=\"\",\"\",VLOOKUP($AB$6:$AB$81,Spielerliste!$A$1:$C$480,2))","v":"Riemer Herbert"},{"$f":"IF($AB$6:$AB$81=\"\",\"\",VLOOKUP($AB$6:$AB$81,Spielerliste!$A$1:$C$480,3))","v":"ESV Br-Wo"},74,17,91,6,67,31,98,4,141,48,189,10]
[18,282,"Marinz Günther","ESV Br-Wo",87,34,121,4,83,42,125,4,170,76,246,8,null,null,null,null,null,null,null,null,null,null,18,192,{"$f":"IF($AB$6:$AB$81=\"\",\"\",VLOOKUP($AB$6:$AB$81,Spielerliste!$A$1:$C$480,2))","v":"Sandholzer Alfred"},{"$f":"IF($AB$6:$AB$81=\"\",\"\",VLOOKUP($AB$6:$AB$81,Spielerliste!$A$1:$C$480,3))","v":"Mäder"},74,51,125,0,76,35,111,2,150,86,236,2]
[19,252,"Maier Wilfried","Vandans",77,27,104,4,88,50,138,0,165,77,242,4,null,null,null,null,null,null,null,null,null,null,19,189,{"$f":"IF($AB$6:$AB$81=\"\",\"\",VLOOKUP($AB$6:$AB$81,Spielerliste!$A$1:$C$480,2))","v":"Riedmann Markus"},{"$f":"IF($AB$6:$AB$81=\"\",\"\",VLOOKUP($AB$6:$AB$81,Spielerliste!$A$1:$C$480,3))","v":"Mäder"},87,26,113,5,84,27,111,4,171,53,224,9]
[20,11,"Berkmann Josef","Bregenz",77,43,120,1,89,33,122,2,166,76,242,3,null,null,null,null,null,null,null,null,null,null,20,185,{"$f":"IF($AB$6:$AB$81=\"\",\"\",VLOOKUP($AB$6:$AB$81,Spielerliste!$A$1:$C$480,2))","v":"Hinteregger Erwin"},{"$f":"IF($AB$6:$AB$81=\"\",\"\",VLOOKUP($AB$6:$AB$81,Spielerliste!$A$1:$C$480,3))","v":"Mäder"},70,26,96,4,83,24,107,4,153,50,203,8]
[21,85,"Hyden Walter","Götzis",87,27,114,4,87,41,128,1,174,68,242,5,null,null,null,null,null,null,null,null,null,null,21,182,{"$f":"IF($AB$6:$AB$81=\"\",\"\",VLOOKUP($AB$6:$AB$81,Spielerliste!$A$1:$C$480,2))","v":"Ender Heinrich"},{"$f":"IF($AB$6:$AB$81=\"\",\"\",VLOOKUP($AB$6:$AB$81,Spielerliste!$A$1:$C$480,3))","v":"Mäder"},75,39,114,4,84,25,109,5,159,64,223,9]
[22,273,"Wiesflecker Edi","Wolfurt",81,45,126,0,86,27,113,4,167,72,239,4,null,null,null,null,null,null,null,null,null,null,22,30,{"$f":"IF($AB$6:$AB$81=\"\",\"\",VLOOKUP($AB$6:$AB$81,Spielerliste!$A$1:$C$480,2))","v":"Virag Peter"},{"$f":"IF($AB$6:$AB$81=\"\",\"\",VLOOKUP($AB$6:$AB$81,Spielerliste!$A$1:$C$480,3))","v":"Bürs"},72,{"$f":"AG27-AE27","v":36},108,3,88,{"$f":"AK27-AI27","v":34},122,1,{"$f":"AE27+AI27","v":160},{"$f":"AF27+AJ27","v":70},{"$f":"AG27+AK27","v":230},{"$f":"AH27+AL27","v":4}]
[23,100,"Pfanner Klaus","Hard",74,43,117,0,87,34,121,5,161,77,238,5,null,null,null,null,null,null,null,null,null,null,23,28,{"$f":"IF($AB$6:$AB$81=\"\",\"\",VLOOKUP($AB$6:$AB$81,Spielerliste!$A$1:$C$480,2))","v":"Stadlmayr Wolfgang"},{"$f":"IF($AB$6:$AB$81=\"\",\"\",VLOOKUP($AB$6:$AB$81,Spielerliste!$A$1:$C$480,3))","v":"Bürs"},79,36,115,3,58,24,82,5,137,60,197,8]
[24,3,"Battisti Anton","Bludenz",81,44,125,1,77,35,112,2,158,79,237,3,null,null,null,null,null,null,null,null,null,null,24,3,{"$f":"IF($AB$6:$AB$81=\"\",\"\",VLOOKUP($AB$6:$AB$81,Spielerliste!$A$1:$C$480,2))","v":"Battisti Anton"},{"$f":"IF($AB$6:$AB$81=\"\",\"\",VLOOKUP($AB$6:$AB$81,Spielerliste!$A$1:$C$480,3))","v":"Bludenz"},81,{"$f":"AG29-AE29","v":44},125,1,77,{"$f":"AK29-AI29","v":35},112,2,{"$f":"AE29+AI29","v":158},{"$f":"AF29+AJ29","v":79},{"$f":"AG29+AK29","v":237},{"$f":"AH29+AL29","v":3}]
[25,97,"Di-Meglio Jean-Luc","Hard",84,27,111,4,81,45,126,3,165,72,237,7,null,null,null,null,null,null,null,null,null,null,25,137,{"$f":"IF($AB$6:$AB$81=\"\",\"\",VLOOKUP($AB$6:$AB$81,Spielerliste!$A$1:$C$480,2))","v":"Haaser Andreas"},{"$f":"IF($AB$6:$AB$81=\"\",\"\",VLOOKUP($AB$6:$AB$81,Spielerliste!$A$1:$C$480,3))","v":"Koblach"},79,18,97,5,75,45,120,1,154,63,217,6]
[26,192,"Sandholzer Alfred","Mäder",74,51,125,0,76,35,111,2,150,86,236,2,null,null,null,null,null,null,null,null,null,null,26,138,{"$f":"IF($AB$6:$AB$81=\"\",\"\",VLOOKUP($AB$6:$AB$81,Spielerliste!$A$1:$C$480,2))","v":"Häusle Norbert"},{"$f":"IF($AB$6:$AB$81=\"\",\"\",VLOOKUP($AB$6:$AB$81,Spielerliste!$A$1:$C$480,3))","v":"Koblach"},72,27,99,4,77,23,100,7,149,50,199,11]
[27,44,"Herceg Niki","Dornbirn",81,23,104,5,86,45,131,1,167,68,235,6,null,null,null,null,null,null,null,null,null,null,27,null,{"$f":"IF($AB$6:$AB$81=\"\",\"\",VLOOKUP($AB$6:$AB$81,Spielerliste!$A$1:$C$480,2))","v":""},{"$f":"IF($AB$6:$AB$81=\"\",\"\",VLOOKUP($AB$6:$AB$81,Spielerliste!$A$1:$C$480,3))","v":""},null,0,null,null,null,0,null,null,0,0,0,0]
[28,269,"Florineth Bruno","Wolfurt",80,43,123,3,75,34,109,2,155,77,232,5,null,null,null,null,null,null,null,null,null,null,28,46,{"$f":"IF($AB$6:$AB$81=\"\",\"\",VLOOKUP($AB$6:$AB$81,Spielerliste!$A$1:$C$480,2))","v":"Kessler Günter"},{"$f":"IF($AB$6:$AB$81=\"\",\"\",VLOOKUP($AB$6:$AB$81,Spielerliste!$A$1:$C$480,3))","v":"Dornbirn"},87,36,123,2,87,51,138,2,174,87,261,4]
[29,30,"Virag Peter","Bürs",72,36,108,3,88,34,122,1,160,70,230,4,null,null,null,null,null,null,null,null,null,null,29,226,{"$f":"IF($AB$6:$AB$81=\"\",\"\",VLOOKUP($AB$6:$AB$81,Spielerliste!$A$1:$C$480,2))","v":"Bastiani Karl"},{"$f":"IF($AB$6:$AB$81=\"\",\"\",VLOOKUP($AB$6:$AB$81,Spielerliste!$A$1:$C$480,3))","v":"Rheindelta"},68,27,95,5,62,16,78,11,130,43,173,16]
[30,188,"Riedmann Wolfgang","Mäder",71,26,97,6,78,52,130,0,149,78,227,6,null,null,null,null,null,null,null,null,null,null,30,230,{"$f":"IF($AB$6:$AB$81=\"\",\"\",VLOOKUP($AB$6:$AB$81,Spielerliste!$A$1:$C$480,2))","v":"Samide Werner"},{"$f":"IF($AB$6:$AB$81=\"\",\"\",VLOOKUP($AB$6:$AB$81,Spielerliste!$A$1:$C$480,3))","v":"Rheindelta"},75,26,101,6,70,41,111,1,145,67,212,7]
[31,88,"Pürstl Wilfried","Götzis",86,33,119,3,74,33,107,4,160,66,226,7,null,null,null,null,null,null,null,null,null,null,31,232,{"$f":"IF($AB$6:$AB$81=\"\",\"\",VLOOKUP($AB$6:$AB$81,Spielerliste!$A$1:$C$480,2))","v":"Schobel Anton"},{"$f":"IF($AB$6:$AB$81=\"\",\"\",VLOOKUP($AB$6:$AB$81,Spielerliste!$A$1:$C$480,3))","v":"Rheindelta"},78,26,104,7,74,44,118,1,152,70,222,8]
[32,45,"Kepe Franz","Dornbirn",87,35,122,2,76,27,103,4,163,62,225,6,null,null,null,null,null,null,null,null,null,null,32,82,{"$f":"IF($AB$6:$AB$81=\"\",\"\",VLOOKUP($AB$6:$AB$81,Spielerliste!$A$1:$C$480,2))","v":"Einwaller Harald"},{"$f":"IF($AB$6:$AB$81=\"\",\"\",VLOOKUP($AB$6:$AB$81,Spielerliste!$A$1:$C$480,3))","v":"Götzis"},82,41,123,0,89,42,131,0,171,83,254,0]
[33,189,"Riedmann Markus","Mäder",87,26,113,5,84,27,111,4,171,53,224,9,null,null,null,null,null,null,null,null,null,null,33,97,{"$f":"IF($AB$6:$AB$81=\"\",\"\",VLOOKUP($AB$6:$AB$81,Spielerliste!$A$1:$C$480,2))","v":"Di-Meglio Jean-Luc"},{"$f":"IF($AB$6:$AB$81=\"\",\"\",VLOOKUP($AB$6:$AB$81,Spielerliste!$A$1:$C$480,3))","v":"Hard"},84,27,111,4,81,45,126,3,165,72,237,7]
[34,182,"Ender Heinrich","Mäder",75,39,114,4,84,25,109,5,159,64,223,9,null,null,null,null,null,null,null,null,null,null,34,220,{"$f":"IF($AB$6:$AB$81=\"\",\"\",VLOOKUP($AB$6:$AB$81,Spielerliste!$A$1:$C$480,2))","v":"Schirgi Wolfgang"},{"$f":"IF($AB$6:$AB$81=\"\",\"\",VLOOKUP($AB$6:$AB$81,Spielerliste!$A$1:$C$480,3))","v":"Rankweil"},80,61,141,2,81,34,115,2,161,95,256,4]
[35,90,"Scherz Ernst","Götzis",86,25,111,7,77,35,112,5,163,60,223,12,null,null,null,null,null,null,null,null,null,null,35,199,{"$f":"IF($AB$6:$AB$81=\"\",\"\",VLOOKUP($AB$6:$AB$81,Spielerliste!$A$1:$C$480,2))","v":"Paulitsch Gottfried"},{"$f":"IF($AB$6:$AB$81=\"\",\"\",VLOOKUP($AB$6:$AB$81,Spielerliste!$A$1:$C$480,3))","v":"Nofels"},87,33,120,3,86,50,136,0,173,83,256,3]
[36,232,"Schobel Anton","Rheindelta",78,26,104,7,74,44,118,1,152,70,222,8,null,null,null,null,null,null,null,null,null,null,36,198,{"$f":"IF($AB$6:$AB$81=\"\",\"\",VLOOKUP($AB$6:$AB$81,Spielerliste!$A$1:$C$480,2))","v":"Mair Otmar"},{"$f":"IF($AB$6:$AB$81=\"\",\"\",VLOOKUP($AB$6:$AB$81,Spielerliste!$A$1:$C$480,3))","v":"Nofels"},87,34,121,2,94,35,129,2,181,69,250,4]
[37,258,"Ströhle Helmut","Vandans",88,26,114,3,79,27,106,1,167,53,220,4,null,null,null,null,null,null,null,null,null,null,37,200,{"$f":"IF($AB$6:$AB$81=\"\",\"\",VLOOKUP($AB$6:$AB$81,Spielerliste!$A$1:$C$480,2))","v":"Peterlunger Valerian"},{"$f":"IF($AB$6:$AB$81=\"\",\"\",VLOOKUP($AB$6:$AB$81,Spielerliste!$A$1:$C$480,3))","v":"Nofels"},81,44,125,1,84,43,127,2,165,87,252,3]
[38,256,"Simenowskyj Stefan","Vandans",67,34,101,4,75,42,117,3,142,76,218,7,null,null,null,null,null,null,null,null,null,null,38,11,{"$f":"IF($AB$6:$AB$81=\"\",\"\",VLOOKUP($AB$6:$AB$81,Spielerliste!$A$1:$C$480,2))","v":"Berkmann Josef"},{"$f":"IF($AB$6:$AB$81=\"\",\"\",VLOOKUP($AB$6:$AB$81,Spielerliste!$A$1:$C$480,3))","v":"Bregenz"},77,43,120,1,89,33,122,2,166,76,242,3]
[39,145,"Metzler Johann","Koblach",80,26,106,5,88,24,112,8,168,50,218,13,null,null,null,null,null,null,null,null,null,null,39,174,{"$f":"IF($AB$6:$AB$81=\"\",\"\",VLOOKUP($AB$6:$AB$81,Spielerliste!$A$1:$C$480,2))","v":"Riedmann Werner"},{"$f":"IF($AB$6:$AB$81=\"\",\"\",VLOOKUP($AB$6:$AB$81,Spielerliste!$A$1:$C$480,3))","v":"Lustenau"},91,43,134,4,91,45,136,0,182,88,270,4]
[40,137,"Haaser Andreas","Koblach",79,18,97,5,75,45,120,1,154,63,217,6,null,null,null,null,null,null,null,null,null,null,40,103,{"$f":"IF($AB$6:$AB$81=\"\",\"\",VLOOKUP($AB$6:$AB$81,Spielerliste!$A$1:$C$480,2))","v":"Woinesich Reinhard"},{"$f":"IF($AB$6:$AB$81=\"\",\"\",VLOOKUP($AB$6:$AB$81,Spielerliste!$A$1:$C$480,3))","v":"Hard"},84,24,108,5,75,27,102,4,159,51,210,9]
[41,294,"Werle Karl","Partenen",83,27,110,4,79,26,105,5,162,53,215,9,null,null,null,null,null,null,null,null,null,null,41,269,{"$f":"IF($AB$6:$AB$81=\"\",\"\",VLOOKUP($AB$6:$AB$81,Spielerliste!$A$1:$C$480,2))","v":"Florineth Bruno"},{"$f":"IF($AB$6:$AB$81=\"\",\"\",VLOOKUP($AB$6:$AB$81,Spielerliste!$A$1:$C$480,3))","v":"Wolfurt"},80,43,123,3,75,34,109,2,155,77,232,5]
[42,261,"Wachter Robert","Vandans",100,25,125,5,63,26,89,5,163,51,214,10,null,null,null,null,null,null,null,null,null,null,42,273,{"$f":"IF($AB$6:$AB$81=\"\",\"\",VLOOKUP($AB$6:$AB$81,Spielerliste!$A$1:$C$480,2))","v":"Wiesflecker Edi"},{"$f":"IF($AB$6:$AB$81=\"\",\"\",VLOOKUP($AB$6:$AB$81,Spielerliste!$A$1:$C$480,3))","v":"Wolfurt"},81,45,126,0,86,27,113,4,167,72,239,4]
[43,230,"Samide Werner","Rheindelta",75,26,101,6,70,41,111,1,145,67,212,7,null,null,null,null,null,null,null,null,null,null,43,100,{"$f":"IF($AB$6:$AB$81=\"\",\"\",VLOOKUP($AB$6:$AB$81,Spielerliste!$A$1:$C$480,2))","v":"Pfanner Klaus"},{"$f":"IF($AB$6:$AB$81=\"\",\"\",VLOOKUP($AB$6:$AB$81,Spielerliste!$A$1:$C$480,3))","v":"Hard"},74,43,117,0,87,34,121,5,161,77,238,5]
[44,103,"Woinesich Reinhard","Hard",84,24,108,5,75,27,102,4,159,51,210,9,null,null,null,null,null,null,null,null,null,null,44,88,{"$f":"IF($AB$6:$AB$81=\"\",\"\",VLOOKUP($AB$6:$AB$81,Spielerliste!$A$1:$C$480,2))","v":"Pürstl Wilfried"},{"$f":"IF($AB$6:$AB$81=\"\",\"\",VLOOKUP($AB$6:$AB$81,Spielerliste!$A$1:$C$480,3))","v":"Götzis"},86,33,119,3,74,33,107,4,160,66,226,7]
[45,259,"Trummer Heinz","Vandans",71,35,106,5,75,25,100,7,146,60,206,12,null,null,null,null,null,null,null,null,null,null,45,87,{"$f":"IF($AB$6:$AB$81=\"\",\"\",VLOOKUP($AB$6:$AB$81,Spielerliste!$A$1:$C$480,2))","v":"Pürstl Richard"},{"$f":"IF($AB$6:$AB$81=\"\",\"\",VLOOKUP($AB$6:$AB$81,Spielerliste!$A$1:$C$480,3))","v":"Götzis"},94,{"$f":"AG50-AE50","v":42},136,1,87,{"$f":"AK50-AI50","v":35},122,3,{"$f":"AE50+AI50","v":181},77,258,4]
[46,1,"Bertsch Gerhard","Bludenz",74,25,99,4,81,26,107,4,155,51,206,8,null,null,null,null,null,null,null,null,null,null,46,151,{"$f":"IF($AB$6:$AB$81=\"\",\"\",VLOOKUP($AB$6:$AB$81,Spielerliste!$A$1:$C$480,2))","v":"Tusch Norbert"},{"$f":"IF($AB$6:$AB$81=\"\",\"\",VLOOKUP($AB$6:$AB$81,Spielerliste!$A$1:$C$480,3))","v":"Koblach"},81,{"$f":"AG51-AE51","v":34},115,3,82,{"$f":"AK51-AI51","v":49},131,1,163,83,246,4]
[47,185,"Hinteregger Erwin","Mäder",70,26,96,4,83,24,107,4,153,50,203,8,null,null,null,null,null,null,null,null,null,null,47,146,{"$f":"IF($AB$6:$AB$81=\"\",\"\",VLOOKUP($AB$6:$AB$81,Spielerliste!$A$1:$C$480,2))","v":"Nikolic Milosav"},{"$f":"IF($AB$6:$AB$81=\"\",\"\",VLOOKUP($AB$6:$AB$81,Spielerliste!$A$1:$C$480,3))","v":"Koblach"},91,{"$f":"AG52-AE52","v":44},135,1,86,{"$f":"AK52-AI52","v":44},130,2,{"$f":"AE52+AI52","v":177},{"$f":"AF52+AJ52","v":88},{"$f":"AG52+AK52","v":265},{"$f":"AH52+AL52","v":3}]
[48,138,"Häusle Norbert","Koblach",72,27,99,4,77,23,100,7,149,50,199,11,null,null,null,null,null,null,null,null,null,null,48,null,{"$f":"IF($AB$6:$AB$81=\"\",\"\",VLOOKUP($AB$6:$AB$81,Spielerliste!$A$1:$C$480,2))","v":""},{"$f":"IF($AB$6:$AB$81=\"\",\"\",VLOOKUP($AB$6:$AB$81,Spielerliste!$A$1:$C$480,3))","v":""},null,0,null,null,null,0,null,null,0,0,0,0]
[49,28,"Stadlmayr Wolfgang","Bürs",79,36,115,3,58,24,82,5,137,60,197,8,null,null,null,null,null,null,null,null,null,null,49,145,{"$f":"IF($AB$6:$AB$81=\"\",\"\",VLOOKUP($AB$6:$AB$81,Spielerliste!$A$1:$C$480,2))","v":"Metzler Johann"},{"$f":"IF($AB$6:$AB$81=\"\",\"\",VLOOKUP($AB$6:$AB$81,Spielerliste!$A$1:$C$480,3))","v":"Koblach"},80,26,106,5,88,24,112,8,168,50,218,13]
[50,292,"Munz Karl","Partenen",70,17,87,6,79,25,104,5,149,42,191,11,null,null,null,null,null,null,null,null,null,null,50,1,{"$f":"IF($AB$6:$AB$81=\"\",\"\",VLOOKUP($AB$6:$AB$81,Spielerliste!$A$1:$C$480,2))","v":"Bertsch Gerhard"},{"$f":"IF($AB$6:$AB$81=\"\",\"\",VLOOKUP($AB$6:$AB$81,Spielerliste!$A$1:$C$480,3))","v":"Bludenz"},74,25,99,4,81,26,107,4,155,51,206,8]
[51,283,"Riemer Herbert","ESV Br-Wo",74,17,91,6,67,31,98,4,141,48,189,10,null,null,null,null,null,null,null,null,null,null,51,45,{"$f":"IF($AB$6:$AB$81=\"\",\"\",VLOOKUP($AB$6:$AB$81,Spielerliste!$A$1:$C$480,2))","v":"Kepe Franz"},{"$f":"IF($AB$6:$AB$81=\"\",\"\",VLOOKUP($AB$6:$AB$81,Spielerliste!$A$1:$C$480,3))","v":"Dornbirn"},87,35,122,2,76,27,103,4,163,62,225,6]
[52,184,"Heinle Otmar","Mäder",54,35,89,8,67,25,92,6,121,60,181,14,null,null,null,null,null,null,null,null,null,null,52,47,{"$f":"IF($AB$6:$AB$81=\"\",\"\",VLOOKUP($AB$6:$AB$81,Spielerliste!$A$1:$C$480,2))","v":"Kezic Blago"},{"$f":"IF($AB$6:$AB$81=\"\",\"\",VLOOKUP($AB$6:$AB$81,Spielerliste!$A$1:$C$480,3))","v":"Dornbirn"},92,35,127,2,82,42,124,2,174,77,251,4]
[53,226,"Bastiani Karl","Rheindelta",68,27,95,5,62,16,78,11,130,43,173,16,null,null,null,null,null,null,null,null,null,null,53,43,{"$f":"IF($AB$6:$AB$81=\"\",\"\",VLOOKUP($AB$6:$AB$81,Spielerliste!$A$1:$C$480,2))","v":"Gradwohl Josef"},{"$f":"IF($AB$6:$AB$81=\"\",\"\",VLOOKUP($AB$6:$AB$81,Spielerliste!$A$1:$C$480,3))","v":"Dornbirn"},86,34,120,2,101,36,137,1,187,70,257,3]
[null,null,null,null,null,null,null,null,null,null,null,null,null,null,null,null,null,null,null,null,null,null,null,null,null,null,54,44,{"$f":"IF($AB$6:$AB$81=\"\",\"\",VLOOKUP($AB$6:$AB$81,Spielerliste!$A$1:$C$480,2))","v":"Herceg Niki"},{"$f":"IF($AB$6:$AB$81=\"\",\"\",VLOOKUP($AB$6:$AB$81,Spielerliste!$A$1:$C$480,3))","v":"Dornbirn"},81,23,104,5,86,45,131,1,167,68,235,6]
[null,null,null,null,null,null,null,null,null,null,null,null,null,null,null,null,null,null,null,null,null,null,null,null,null,null,55,54,{"$f":"IF($AB$6:$AB$81=\"\",\"\",VLOOKUP($AB$6:$AB$81,Spielerliste!$A$1:$C$480,2))","v":"Vauce Gottfried"},{"$f":"IF($AB$6:$AB$81=\"\",\"\",VLOOKUP($AB$6:$AB$81,Spielerliste!$A$1:$C$480,3))","v":"Dornbirn"},99,{"$f":"AG60-AE60","v":34},133,2,79,{"$f":"AK60-AI60","v":35},114,2,{"$f":"AE60+AI60","v":178},{"$f":"AF60+AJ60","v":69},{"$f":"AG60+AK60","v":247},{"$f":"AH60+AL60","v":4}]

{"sheet":"EM 60 Wurf Herren 2","index":2,"n_rows":65,"n_cols":42,"rows_kept":65,"cut":false,"hidden":false,"merged":[[3,27,4,27],[0,0,0,15],[0,26,0,41],[1,0,1,15],[1,26,1,41],[3,0,4,0],[3,1,4,1],[3,2,4,2],[3,3,4,3],[3,4,3,7],[3,8,3,11],[3,12,4,12],[3,13,4,13],[3,14,4,14],[3,15,4,15],[3,26,4,26],[3,40,4,40],[3,41,4,41],[3,28,4,28],[3,29,4,29],[3,30,3,33],[3,34,3,37],[3,38,4,38],[3,39,4,39]]}
["60 Wurf - Einzelmeisterschaft  2019/20",null,null,null,null,null,null,null,null,null,null,null,null,null,null,null,null,null,null,null,null,null,null,null,null,null,"Einzelmeisterschaft  2019/20"]
["Ergebnisliste - HERREN 2",null,null,null,null,null,null,null,null,null,null,null,null,null,null,null,null,null,null,null,null,null,null,null,null,null,"Ergebnisliste - HERREN 2"]
[]
["Pl.",null,"Name","Ortsgr.","1. Durchgang",null,null,null,"2. Durchgang",null,null,null,"Volle","Abr.","Ges.","FW",null,null,null,null,null,null,null,null,null,null,"Pl.",null,"Name","Ortsgr.","1. Durchgang",null,null,null,"2. Durchgang",null,null,null,"Volle","Abr.","Ges.","FW"]
[null,null,null,null,"V","A","G","FW","V","A","G","FW",null,null,null,null,null,null,null,null,null,null,null,null,null,null,null,null,null,null,"V","A","G","FW","V","A","G","FW"]
[1,117,"Prugg Franz","Hohenems",91,52,143,0,86,41,127,3,177,93,270,3,null,null,null,null,null,null,null,null,null,null,1,172,{"$f":"IF($AB$6:$AB$80=\"\",\"\",VLOOKUP($AB$6:$AB$80,Spielerliste!$A$1:$C$480,2))","v":"Millien Karl"},{"$f":"IF($AB$6:$AB$80=\"\",\"\",VLOOKUP($AB$6:$AB$80,Spielerliste!$A$1:$C$480,3))","v":"Lustenau"},68,{"$f":"AG6-AE6","v":36},104,4,75,{"$f":"AK6-AI6","v":18},93,8,{"$f":"AE6+AI6","v":143},54,197,12]
[2,148,"Schatzer Günther","Koblach",85,54,139,1,95,35,130,1,180,89,269,2,null,null,null,null,null,null,null,null,null,null,2,101,{"$f":"IF($AB$6:$AB$80=\"\",\"\",VLOOKUP($AB$6:$AB$80,Spielerliste!$A$1:$C$480,2))","v":"Prutsch Franz"},{"$f":"IF($AB$6:$AB$80=\"\",\"\",VLOOKUP($AB$6:$AB$80,Spielerliste!$A$1:$C$480,3))","v":"Hard"},84,37,121,1,76,34,110,4,160,71,231,5]
[3,267,"Bischelsberger Helmut","Wolfurt",85,53,138,2,85,44,129,2,170,97,267,4,null,null,null,null,null,null,null,null,null,null,3,39,{"$f":"IF($AB$6:$AB$80=\"\",\"\",VLOOKUP($AB$6:$AB$80,Spielerliste!$A$1:$C$480,2))","v":"Berthold Alfons"},{"$f":"IF($AB$6:$AB$80=\"\",\"\",VLOOKUP($AB$6:$AB$80,Spielerliste!$A$1:$C$480,3))","v":"Dornbirn"},76,43,119,2,82,43,125,2,158,86,244,4]
[4,31,"Voltolini Siegfried","Bürs",88,42,130,0,99,33,132,4,187,75,262,4,null,null,null,null,null,null,null,null,null,null,4,55,{"$f":"IF($AB$6:$AB$80=\"\",\"\",VLOOKUP($AB$6:$AB$80,Spielerliste!$A$1:$C$480,2))","v":"Winder Josef"},{"$f":"IF($AB$6:$AB$80=\"\",\"\",VLOOKUP($AB$6:$AB$80,Spielerliste!$A$1:$C$480,3))","v":"Dornbirn"},83,34,117,3,78,36,114,3,161,70,231,6]
[5,275,"Wolf Othmar","Wolfurt",97,33,130,2,90,42,132,3,187,75,262,5,null,null,null,null,null,null,null,null,null,null,5,null,{"$f":"IF($AB$6:$AB$80=\"\",\"\",VLOOKUP($AB$6:$AB$80,Spielerliste!$A$1:$C$480,2))","v":""},{"$f":"IF($AB$6:$AB$80=\"\",\"\",VLOOKUP($AB$6:$AB$80,Spielerliste!$A$1:$C$480,3))","v":""},null,0,null,null,null,0,null,null,0,0,0,0]
[6,27,"Scherrer Martin","Bürs",87,45,132,3,84,45,129,0,171,90,261,3,null,null,null,null,null,null,null,null,null,null,6,291,{"$f":"IF($AB$6:$AB$80=\"\",\"\",VLOOKUP($AB$6:$AB$80,Spielerliste!$A$1:$C$480,2))","v":"Klinger Franz"},{"$f":"IF($AB$6:$AB$80=\"\",\"\",VLOOKUP($AB$6:$AB$80,Spielerliste!$A$1:$C$480,3))","v":"Partenen"},74,24,98,5,77,25,102,6,151,49,200,11]
[7,69,"Rüscher Kolumban","Feldkirch",87,43,130,1,86,44,130,2,173,87,260,3,null,null,null,null,null,null,null,null,null,null,7,293,{"$f":"IF($AB$6:$AB$80=\"\",\"\",VLOOKUP($AB$6:$AB$80,Spielerliste!$A$1:$C$480,2))","v":"Pachole Bruno"},{"$f":"IF($AB$6:$AB$80=\"\",\"\",VLOOKUP($AB$6:$AB$80,Spielerliste!$A$1:$C$480,3))","v":"Partenen"},71,42,113,2,76,25,101,4,147,67,214,6]
[8,62,"Fink Reinold","Feldkirch",87,43,130,3,95,35,130,2,182,78,260,5,null,null,null,null,null,null,null,null,null,null,8,115,{"$f":"IF($AB$6:$AB$80=\"\",\"\",VLOOKUP($AB$6:$AB$80,Spielerliste!$A$1:$C$480,2))","v":"Mitteregger Herbert"},{"$f":"IF($AB$6:$AB$80=\"\",\"\",VLOOKUP($AB$6:$AB$80,Spielerliste!$A$1:$C$480,3))","v":"Hohenems"},82,53,135,1,81,34,115,1,163,87,250,2]
[9,212,"Ender Helmut","Rankweil",90,45,135,0,70,51,121,0,160,96,256,0,null,null,null,null,null,null,null,null,null,null,9,247,{"$f":"IF($AB$6:$AB$80=\"\",\"\",VLOOKUP($AB$6:$AB$80,Spielerliste!$A$1:$C$480,2))","v":"Bodingbauer Herbert"},{"$f":"IF($AB$6:$AB$80=\"\",\"\",VLOOKUP($AB$6:$AB$80,Spielerliste!$A$1:$C$480,3))","v":"Vandans"},80,16,96,10,73,26,99,3,153,42,195,13]
[10,133,"Egle Norbert","Koblach",92,45,137,0,81,34,115,1,173,79,252,1,null,null,null,null,null,null,null,null,null,null,10,248,{"$f":"IF($AB$6:$AB$80=\"\",\"\",VLOOKUP($AB$6:$AB$80,Spielerliste!$A$1:$C$480,2))","v":"Bolter Manfred"},{"$f":"IF($AB$6:$AB$80=\"\",\"\",VLOOKUP($AB$6:$AB$80,Spielerliste!$A$1:$C$480,3))","v":"Vandans"},80,18,98,6,79,44,123,1,159,62,221,7]
[11,40,"Ehgartner Wolfgang","Dornbirn",95,33,128,3,82,41,123,0,177,74,251,3,null,null,null,null,null,null,null,null,null,null,11,249,{"$f":"IF($AB$6:$AB$80=\"\",\"\",VLOOKUP($AB$6:$AB$80,Spielerliste!$A$1:$C$480,2))","v":"Egle Herbert"},{"$f":"IF($AB$6:$AB$80=\"\",\"\",VLOOKUP($AB$6:$AB$80,Spielerliste!$A$1:$C$480,3))","v":"Vandans"},76,36,112,3,85,36,121,2,161,72,233,5]
[12,115,"Mitteregger Herbert","Hohenems",82,53,135,1,81,34,115,1,163,87,250,2,null,null,null,null,null,null,null,null,null,null,12,251,{"$f":"IF($AB$6:$AB$80=\"\",\"\",VLOOKUP($AB$6:$AB$80,Spielerliste!$A$1:$C$480,2))","v":"Kleboth Günther"},{"$f":"IF($AB$6:$AB$80=\"\",\"\",VLOOKUP($AB$6:$AB$80,Spielerliste!$A$1:$C$480,3))","v":"Vandans"},68,34,102,3,63,18,81,9,131,52,183,12]
[13,29,"Thönig Gilbert","Bürs",87,43,130,1,82,35,117,3,169,78,247,4,null,null,null,null,null,null,null,null,null,null,13,117,{"$f":"IF($AB$6:$AB$80=\"\",\"\",VLOOKUP($AB$6:$AB$80,Spielerliste!$A$1:$C$480,2))","v":"Prugg Franz"},{"$f":"IF($AB$6:$AB$80=\"\",\"\",VLOOKUP($AB$6:$AB$80,Spielerliste!$A$1:$C$480,3))","v":"Hohenems"},91,52,143,0,86,41,127,3,177,93,270,3]
[14,39,"Berthold Alfons","Dornbirn",76,43,119,2,82,43,125,2,158,86,244,4,null,null,null,null,null,null,null,null,null,null,14,253,{"$f":"IF($AB$6:$AB$80=\"\",\"\",VLOOKUP($AB$6:$AB$80,Spielerliste!$A$1:$C$480,2))","v":"Nägele Anton"},{"$f":"IF($AB$6:$AB$80=\"\",\"\",VLOOKUP($AB$6:$AB$80,Spielerliste!$A$1:$C$480,3))","v":"Vandans"},83,27,110,5,94,26,120,5,177,53,230,10]
[15,281,"Brichaz Franz","ESV Br-Wo",83,36,119,2,83,41,124,0,166,77,243,2,null,null,null,null,null,null,null,null,null,null,15,133,{"$f":"IF($AB$6:$AB$80=\"\",\"\",VLOOKUP($AB$6:$AB$80,Spielerliste!$A$1:$C$480,2))","v":"Egle Norbert"},{"$f":"IF($AB$6:$AB$80=\"\",\"\",VLOOKUP($AB$6:$AB$80,Spielerliste!$A$1:$C$480,3))","v":"Koblach"},92,45,137,0,81,34,115,1,173,79,252,1]
[16,242,"Vazovec Roman","Vorderwald",85,45,130,1,84,25,109,5,169,70,239,6,null,null,null,null,null,null,null,null,null,null,16,null,{"$f":"IF($AB$6:$AB$80=\"\",\"\",VLOOKUP($AB$6:$AB$80,Spielerliste!$A$1:$C$480,2))","v":""},{"$f":"IF($AB$6:$AB$80=\"\",\"\",VLOOKUP($AB$6:$AB$80,Spielerliste!$A$1:$C$480,3))","v":""},null,0,null,null,null,0,null,null,0,0,0,0]
[17,135,"Fleisch Friedl","Koblach",80,41,121,1,90,27,117,4,170,68,238,5,null,null,null,null,null,null,null,null,null,null,17,281,{"$f":"IF($AB$6:$AB$80=\"\",\"\",VLOOKUP($AB$6:$AB$80,Spielerliste!$A$1:$C$480,2))","v":"Brichaz Franz"},{"$f":"IF($AB$6:$AB$80=\"\",\"\",VLOOKUP($AB$6:$AB$80,Spielerliste!$A$1:$C$480,3))","v":"ESV Br-Wo"},83,36,119,2,83,41,124,0,166,77,243,2]
[18,268,"Dostal Christian","Wolfurt",73,35,108,1,83,45,128,1,156,80,236,2,null,null,null,null,null,null,null,null,null,null,18,68,{"$f":"IF($AB$6:$AB$80=\"\",\"\",VLOOKUP($AB$6:$AB$80,Spielerliste!$A$1:$C$480,2))","v":"Porod Klaus"},{"$f":"IF($AB$6:$AB$80=\"\",\"\",VLOOKUP($AB$6:$AB$80,Spielerliste!$A$1:$C$480,3))","v":"Feldkirch"},92,18,110,9,85,34,119,6,177,52,229,15]
[19,63,"Kodal Heribert","Feldkirch",85,43,128,2,73,35,108,1,158,78,236,3,null,null,null,null,null,null,null,null,null,null,19,69,{"$f":"IF($AB$6:$AB$80=\"\",\"\",VLOOKUP($AB$6:$AB$80,Spielerliste!$A$1:$C$480,2))","v":"Rüscher Kolumban"},{"$f":"IF($AB$6:$AB$80=\"\",\"\",VLOOKUP($AB$6:$AB$80,Spielerliste!$A$1:$C$480,3))","v":"Feldkirch"},87,43,130,1,86,44,130,2,173,87,260,3]
[20,213,"Fetzel Anton","Rankweil",82,41,123,0,87,25,112,4,169,66,235,4,null,null,null,null,null,null,null,null,null,null,20,62,{"$f":"IF($AB$6:$AB$80=\"\",\"\",VLOOKUP($AB$6:$AB$80,Spielerliste!$A$1:$C$480,2))","v":"Fink Reinold"},{"$f":"IF($AB$6:$AB$80=\"\",\"\",VLOOKUP($AB$6:$AB$80,Spielerliste!$A$1:$C$480,3))","v":"Feldkirch"},87,43,130,3,95,35,130,2,182,78,260,5]
[21,270,"Lick Max","Wolfurt",87,34,121,1,89,25,114,4,176,59,235,5,null,null,null,null,null,null,null,null,null,null,21,63,{"$f":"IF($AB$6:$AB$80=\"\",\"\",VLOOKUP($AB$6:$AB$80,Spielerliste!$A$1:$C$480,2))","v":"Kodal Heribert"},{"$f":"IF($AB$6:$AB$80=\"\",\"\",VLOOKUP($AB$6:$AB$80,Spielerliste!$A$1:$C$480,3))","v":"Feldkirch"},85,43,128,2,73,35,108,1,158,78,236,3]
[22,147,"Pieber Anton","Koblach",73,53,126,2,82,26,108,3,155,79,234,5,null,null,null,null,null,null,null,null,null,null,22,193,{"$f":"IF($AB$6:$AB$80=\"\",\"\",VLOOKUP($AB$6:$AB$80,Spielerliste!$A$1:$C$480,2))","v":"Vallant Karl"},{"$f":"IF($AB$6:$AB$80=\"\",\"\",VLOOKUP($AB$6:$AB$80,Spielerliste!$A$1:$C$480,3))","v":"Mäder"},81,36,117,2,87,25,112,5,168,61,229,7]
[23,139,"Häusle Reinhold","Koblach",75,43,118,3,71,44,115,0,146,87,233,3,null,null,null,null,null,null,null,null,null,null,23,27,{"$f":"IF($AB$6:$AB$80=\"\",\"\",VLOOKUP($AB$6:$AB$80,Spielerliste!$A$1:$C$480,2))","v":"Scherrer Martin"},{"$f":"IF($AB$6:$AB$80=\"\",\"\",VLOOKUP($AB$6:$AB$80,Spielerliste!$A$1:$C$480,3))","v":"Bürs"},87,45,132,3,84,45,129,0,171,90,261,3]
[24,249,"Egle Herbert","Vandans",76,36,112,3,85,36,121,2,161,72,233,5,null,null,null,null,null,null,null,null,null,null,24,147,{"$f":"IF($AB$6:$AB$80=\"\",\"\",VLOOKUP($AB$6:$AB$80,Spielerliste!$A$1:$C$480,2))","v":"Pieber Anton"},{"$f":"IF($AB$6:$AB$80=\"\",\"\",VLOOKUP($AB$6:$AB$80,Spielerliste!$A$1:$C$480,3))","v":"Koblach"},73,53,126,2,82,26,108,3,155,79,234,5]
[25,101,"Prutsch Franz","Hard",84,37,121,1,76,34,110,4,160,71,231,5,null,null,null,null,null,null,null,null,null,null,25,149,{"$f":"IF($AB$6:$AB$80=\"\",\"\",VLOOKUP($AB$6:$AB$80,Spielerliste!$A$1:$C$480,2))","v":"Schellhorn Ludwig"},{"$f":"IF($AB$6:$AB$80=\"\",\"\",VLOOKUP($AB$6:$AB$80,Spielerliste!$A$1:$C$480,3))","v":"Koblach"},90,26,116,6,69,25,94,5,159,51,210,11]
[26,231,"Scheiber Felix","Rheindelta",75,43,118,2,86,27,113,2,161,70,231,4,null,null,null,null,null,null,null,null,null,null,26,31,{"$f":"IF($AB$6:$AB$80=\"\",\"\",VLOOKUP($AB$6:$AB$80,Spielerliste!$A$1:$C$480,2))","v":"Voltolini Siegfried"},{"$f":"IF($AB$6:$AB$80=\"\",\"\",VLOOKUP($AB$6:$AB$80,Spielerliste!$A$1:$C$480,3))","v":"Bürs"},88,42,130,0,99,33,132,4,187,75,262,4]
[27,55,"Winder Josef","Dornbirn",83,34,117,3,78,36,114,3,161,70,231,6,null,null,null,null,null,null,null,null,null,null,27,29,{"$f":"IF($AB$6:$AB$80=\"\",\"\",VLOOKUP($AB$6:$AB$80,Spielerliste!$A$1:$C$480,2))","v":"Thönig Gilbert"},{"$f":"IF($AB$6:$AB$80=\"\",\"\",VLOOKUP($AB$6:$AB$80,Spielerliste!$A$1:$C$480,3))","v":"Bürs"},87,43,130,1,82,35,117,3,169,78,247,4]
[28,238,"Jäger Heinz","Vorderwald",70,41,111,1,84,35,119,2,154,76,230,3,null,null,null,null,null,null,null,null,null,null,28,26,{"$f":"IF($AB$6:$AB$80=\"\",\"\",VLOOKUP($AB$6:$AB$80,Spielerliste!$A$1:$C$480,2))","v":"Hepberger Erwin"},{"$f":"IF($AB$6:$AB$80=\"\",\"\",VLOOKUP($AB$6:$AB$80,Spielerliste!$A$1:$C$480,3))","v":"Bürs"},61,24,85,5,70,27,97,7,131,51,182,12]
[29,253,"Nägele Anton","Vandans",83,27,110,5,94,26,120,5,177,53,230,10,null,null,null,null,null,null,null,null,null,null,29,148,{"$f":"IF($AB$6:$AB$80=\"\",\"\",VLOOKUP($AB$6:$AB$80,Spielerliste!$A$1:$C$480,2))","v":"Schatzer Günther"},{"$f":"IF($AB$6:$AB$80=\"\",\"\",VLOOKUP($AB$6:$AB$80,Spielerliste!$A$1:$C$480,3))","v":"Koblach"},85,54,139,1,95,35,130,1,180,89,269,2]
[30,211,"Dreier Fridolin","Rankweil",77,26,103,4,84,42,126,3,161,68,229,7,null,null,null,null,null,null,null,null,null,null,30,139,{"$f":"IF($AB$6:$AB$80=\"\",\"\",VLOOKUP($AB$6:$AB$80,Spielerliste!$A$1:$C$480,2))","v":"Häusle Reinhold"},{"$f":"IF($AB$6:$AB$80=\"\",\"\",VLOOKUP($AB$6:$AB$80,Spielerliste!$A$1:$C$480,3))","v":"Koblach"},75,43,118,3,71,44,115,0,146,87,233,3]
[31,193,"Vallant Karl","Mäder",81,36,117,2,87,25,112,5,168,61,229,7,null,null,null,null,null,null,null,null,null,null,31,135,{"$f":"IF($AB$6:$AB$80=\"\",\"\",VLOOKUP($AB$6:$AB$80,Spielerliste!$A$1:$C$480,2))","v":"Fleisch Friedl"},{"$f":"IF($AB$6:$AB$80=\"\",\"\",VLOOKUP($AB$6:$AB$80,Spielerliste!$A$1:$C$480,3))","v":"Koblach"},80,41,121,1,90,27,117,4,170,68,238,5]
[32,68,"Porod Klaus","Feldkirch",92,18,110,9,85,34,119,6,177,52,229,15,null,null,null,null,null,null,null,null,null,null,32,140,{"$f":"IF($AB$6:$AB$80=\"\",\"\",VLOOKUP($AB$6:$AB$80,Spielerliste!$A$1:$C$480,2))","v":"Hohensinger Franz"},{"$f":"IF($AB$6:$AB$80=\"\",\"\",VLOOKUP($AB$6:$AB$80,Spielerliste!$A$1:$C$480,3))","v":"Koblach"},86,26,112,5,76,27,103,5,162,53,215,10]
[33,168,"Hoos Ferenc","Lustenau",73,36,109,3,82,32,114,3,155,68,223,6,null,null,null,null,null,null,null,null,null,null,33,null,{"$f":"IF($AB$6:$AB$80=\"\",\"\",VLOOKUP($AB$6:$AB$80,Spielerliste!$A$1:$C$480,2))","v":""},{"$f":"IF($AB$6:$AB$80=\"\",\"\",VLOOKUP($AB$6:$AB$80,Spielerliste!$A$1:$C$480,3))","v":""},null,0,null,null,null,0,null,null,{"$f":"AE38+AI38","v":0},0,0,0]
[34,89,"Schatzmann Robert","Götzis",79,34,113,3,74,34,108,4,153,68,221,7,null,null,null,null,null,null,null,null,null,null,34,238,{"$f":"IF($AB$6:$AB$80=\"\",\"\",VLOOKUP($AB$6:$AB$80,Spielerliste!$A$1:$C$480,2))","v":"Jäger Heinz"},{"$f":"IF($AB$6:$AB$80=\"\",\"\",VLOOKUP($AB$6:$AB$80,Spielerliste!$A$1:$C$480,3))","v":"Vorderwald"},70,41,111,1,84,35,119,2,154,76,230,3]
[35,248,"Bolter Manfred","Vandans",80,18,98,6,79,44,123,1,159,62,221,7,null,null,null,null,null,null,null,null,null,null,35,242,{"$f":"IF($AB$6:$AB$80=\"\",\"\",VLOOKUP($AB$6:$AB$80,Spielerliste!$A$1:$C$480,2))","v":"Vazovec Roman"},{"$f":"IF($AB$6:$AB$80=\"\",\"\",VLOOKUP($AB$6:$AB$80,Spielerliste!$A$1:$C$480,3))","v":"Vorderwald"},85,45,130,1,84,25,109,5,169,70,239,6]
[36,227,"Fetz Hans","Rheindelta",83,33,116,4,81,24,105,6,164,57,221,10,null,null,null,null,null,null,null,null,null,null,36,96,{"$f":"IF($AB$6:$AB$80=\"\",\"\",VLOOKUP($AB$6:$AB$80,Spielerliste!$A$1:$C$480,2))","v":"Bickel Manfred"},{"$f":"IF($AB$6:$AB$80=\"\",\"\",VLOOKUP($AB$6:$AB$80,Spielerliste!$A$1:$C$480,3))","v":"Hard"},66,42,108,2,73,18,91,8,139,60,199,10]
[37,221,"Simoner Gottfried","Rankweil",71,35,106,2,81,33,114,4,152,68,220,6,null,null,null,null,null,null,null,null,null,null,37,227,{"$f":"IF($AB$6:$AB$80=\"\",\"\",VLOOKUP($AB$6:$AB$80,Spielerliste!$A$1:$C$480,2))","v":"Fetz Hans"},{"$f":"IF($AB$6:$AB$80=\"\",\"\",VLOOKUP($AB$6:$AB$80,Spielerliste!$A$1:$C$480,3))","v":"Rheindelta"},83,33,116,4,81,24,105,6,164,57,221,10]
[38,274,"Wipplinger Hubert","Wolfurt",76,26,102,1,81,35,116,3,157,61,218,4,null,null,null,null,null,null,null,null,null,null,38,231,{"$f":"IF($AB$6:$AB$80=\"\",\"\",VLOOKUP($AB$6:$AB$80,Spielerliste!$A$1:$C$480,2))","v":"Scheiber Felix"},{"$f":"IF($AB$6:$AB$80=\"\",\"\",VLOOKUP($AB$6:$AB$80,Spielerliste!$A$1:$C$480,3))","v":"Rheindelta"},75,43,118,2,86,27,113,2,161,70,231,4]
[39,272,"Moser Mathias","Wolfurt",82,34,116,4,77,25,102,5,159,59,218,9,null,null,null,null,null,null,null,null,null,null,39,213,{"$f":"IF($AB$6:$AB$80=\"\",\"\",VLOOKUP($AB$6:$AB$80,Spielerliste!$A$1:$C$480,2))","v":"Fetzel Anton"},{"$f":"IF($AB$6:$AB$80=\"\",\"\",VLOOKUP($AB$6:$AB$80,Spielerliste!$A$1:$C$480,3))","v":"Rankweil"},82,41,123,0,87,25,112,4,169,66,235,4]
[40,140,"Hohensinger Franz","Koblach",86,26,112,5,76,27,103,5,162,53,215,10,null,null,null,null,null,null,null,null,null,null,40,228,{"$f":"IF($AB$6:$AB$80=\"\",\"\",VLOOKUP($AB$6:$AB$80,Spielerliste!$A$1:$C$480,2))","v":"Gobbi Paolo"},{"$f":"IF($AB$6:$AB$80=\"\",\"\",VLOOKUP($AB$6:$AB$80,Spielerliste!$A$1:$C$480,3))","v":"Rheindelta"},82,25,107,4,80,18,98,7,162,43,205,11]
[41,293,"Pachole Bruno","Partenen",71,42,113,2,76,25,101,4,147,67,214,6,null,null,null,null,null,null,null,null,null,null,41,211,{"$f":"IF($AB$6:$AB$80=\"\",\"\",VLOOKUP($AB$6:$AB$80,Spielerliste!$A$1:$C$480,2))","v":"Dreier Fridolin"},{"$f":"IF($AB$6:$AB$80=\"\",\"\",VLOOKUP($AB$6:$AB$80,Spielerliste!$A$1:$C$480,3))","v":"Rankweil"},77,26,103,4,84,42,126,3,161,68,229,7]
[42,166,"Brauchard Johann","Lustenau",76,33,109,3,77,26,103,9,153,59,212,12,null,null,null,null,null,null,null,null,null,null,42,212,{"$f":"IF($AB$6:$AB$80=\"\",\"\",VLOOKUP($AB$6:$AB$80,Spielerliste!$A$1:$C$480,2))","v":"Ender Helmut"},{"$f":"IF($AB$6:$AB$80=\"\",\"\",VLOOKUP($AB$6:$AB$80,Spielerliste!$A$1:$C$480,3))","v":"Rankweil"},90,45,135,0,70,51,121,0,160,96,256,0]
[43,48,"Kofler Reinhard","Dornbirn",86,27,113,5,72,27,99,6,158,54,212,11,null,null,null,null,null,null,null,null,null,null,43,161,{"$f":"IF($AB$6:$AB$80=\"\",\"\",VLOOKUP($AB$6:$AB$80,Spielerliste!$A$1:$C$480,2))","v":"Koppler Günter"},{"$f":"IF($AB$6:$AB$80=\"\",\"\",VLOOKUP($AB$6:$AB$80,Spielerliste!$A$1:$C$480,3))","v":"Lauterach"},78,26,104,5,73,30,103,3,151,56,207,8]
[44,255,"Schwarzendahl Dieter","Vandans",74,35,109,2,75,27,102,5,149,62,211,7,null,null,null,null,null,null,null,null,null,null,44,218,{"$f":"IF($AB$6:$AB$80=\"\",\"\",VLOOKUP($AB$6:$AB$80,Spielerliste!$A$1:$C$480,2))","v":"Müllauer Ernst"},{"$f":"IF($AB$6:$AB$80=\"\",\"\",VLOOKUP($AB$6:$AB$80,Spielerliste!$A$1:$C$480,3))","v":"Rankweil"},81,33,114,4,73,24,97,5,154,57,211,9]
[45,218,"Müllauer Ernst","Rankweil",81,33,114,4,73,24,97,5,154,57,211,9,null,null,null,null,null,null,null,null,null,null,45,166,{"$f":"IF($AB$6:$AB$80=\"\",\"\",VLOOKUP($AB$6:$AB$80,Spielerliste!$A$1:$C$480,2))","v":"Brauchard Johann"},{"$f":"IF($AB$6:$AB$80=\"\",\"\",VLOOKUP($AB$6:$AB$80,Spielerliste!$A$1:$C$480,3))","v":"Lustenau"},76,33,109,3,77,26,103,9,153,59,212,12]
[46,149,"Schellhorn Ludwig","Koblach",90,26,116,6,69,25,94,5,159,51,210,11,null,null,null,null,null,null,null,null,null,null,46,221,{"$f":"IF($AB$6:$AB$80=\"\",\"\",VLOOKUP($AB$6:$AB$80,Spielerliste!$A$1:$C$480,2))","v":"Simoner Gottfried"},{"$f":"IF($AB$6:$AB$80=\"\",\"\",VLOOKUP($AB$6:$AB$80,Spielerliste!$A$1:$C$480,3))","v":"Rankweil"},71,35,106,2,81,33,114,4,152,68,220,6]
[47,170,"Karitnig Franz","Lustenau",76,26,102,5,82,25,107,5,158,51,209,10,null,null,null,null,null,null,null,null,null,null,47,176,{"$f":"IF($AB$6:$AB$80=\"\",\"\",VLOOKUP($AB$6:$AB$80,Spielerliste!$A$1:$C$480,2))","v":"Witschnigg Johann"},{"$f":"IF($AB$6:$AB$80=\"\",\"\",VLOOKUP($AB$6:$AB$80,Spielerliste!$A$1:$C$480,3))","v":"Lustenau"},68,17,85,7,70,17,87,11,138,34,172,18]
[48,161,"Koppler Günter","Lauterach",78,26,104,5,73,30,103,3,151,56,207,8,null,null,null,null,null,null,null,null,null,null,48,270,{"$f":"IF($AB$6:$AB$80=\"\",\"\",VLOOKUP($AB$6:$AB$80,Spielerliste!$A$1:$C$480,2))","v":"Lick Max"},{"$f":"IF($AB$6:$AB$80=\"\",\"\",VLOOKUP($AB$6:$AB$80,Spielerliste!$A$1:$C$480,3))","v":"Wolfurt"},87,34,121,1,89,25,114,4,176,59,235,5]
[49,228,"Gobbi Paolo","Rheindelta",82,25,107,4,80,18,98,7,162,43,205,11,null,null,null,null,null,null,null,null,null,null,49,168,{"$f":"IF($AB$6:$AB$80=\"\",\"\",VLOOKUP($AB$6:$AB$80,Spielerliste!$A$1:$C$480,2))","v":"Hoos Ferenc"},{"$f":"IF($AB$6:$AB$80=\"\",\"\",VLOOKUP($AB$6:$AB$80,Spielerliste!$A$1:$C$480,3))","v":"Lustenau"},73,36,109,3,82,32,114,3,155,68,223,6]
[50,291,"Klinger Franz","Partenen",74,24,98,5,77,25,102,6,151,49,200,11,null,null,null,null,null,null,null,null,null,null,50,170,{"$f":"IF($AB$6:$AB$80=\"\",\"\",VLOOKUP($AB$6:$AB$80,Spielerliste!$A$1:$C$480,2))","v":"Karitnig Franz"},{"$f":"IF($AB$6:$AB$80=\"\",\"\",VLOOKUP($AB$6:$AB$80,Spielerliste!$A$1:$C$480,3))","v":"Lustenau"},76,26,102,5,82,25,107,5,158,51,209,10]
[51,96,"Bickel Manfred","Hard",66,42,108,2,73,18,91,8,139,60,199,10,null,null,null,null,null,null,null,null,null,null,51,274,{"$f":"IF($AB$6:$AB$80=\"\",\"\",VLOOKUP($AB$6:$AB$80,Spielerliste!$A$1:$C$480,2))","v":"Wipplinger Hubert"},{"$f":"IF($AB$6:$AB$80=\"\",\"\",VLOOKUP($AB$6:$AB$80,Spielerliste!$A$1:$C$480,3))","v":"Wolfurt"},76,26,102,1,81,35,116,3,157,61,218,4]
[52,172,"Millien Karl","Lustenau",68,36,104,4,75,18,93,8,143,54,197,12,null,null,null,null,null,null,null,null,null,null,52,275,{"$f":"IF($AB$6:$AB$80=\"\",\"\",VLOOKUP($AB$6:$AB$80,Spielerliste!$A$1:$C$480,2))","v":"Wolf Othmar"},{"$f":"IF($AB$6:$AB$80=\"\",\"\",VLOOKUP($AB$6:$AB$80,Spielerliste!$A$1:$C$480,3))","v":"Wolfurt"},97,33,130,2,90,42,132,3,187,75,262,5]
[53,247,"Bodingbauer Herbert","Vandans",80,16,96,10,73,26,99,3,153,42,195,13,null,null,null,null,null,null,null,null,null,null,53,267,{"$f":"IF($AB$6:$AB$80=\"\",\"\",VLOOKUP($AB$6:$AB$80,Spielerliste!$A$1:$C$480,2))","v":"Bischelsberger Helmut"},{"$f":"IF($AB$6:$AB$80=\"\",\"\",VLOOKUP($AB$6:$AB$80,Spielerliste!$A$1:$C$480,3))","v":"Wolfurt"},85,53,138,2,85,44,129,2,170,97,267,4]
[54,251,"Kleboth Günther","Vandans",68,34,102,3,63,18,81,9,131,52,183,12,null,null,null,null,null,null,null,null,null,null,54,255,{"$f":"IF($AB$6:$AB$80=\"\",\"\",VLOOKUP($AB$6:$AB$80,Spielerliste!$A$1:$C$480,2))","v":"Schwarzendahl Dieter"},{"$f":"IF($AB$6:$AB$80=\"\",\"\",VLOOKUP($AB$6:$AB$80,Spielerliste!$A$1:$C$480,3))","v":"Vandans"},74,35,109,2,75,27,102,5,149,62,211,7]
[55,26,"Hepberger Erwin","Bürs",61,24,85,5,70,27,97,7,131,51,182,12,null,null,null,null,null,null,null,null,null,null,55,272,{"$f":"IF($AB$6:$AB$80=\"\",\"\",VLOOKUP($AB$6:$AB$80,Spielerliste!$A$1:$C$480,2))","v":"Moser Mathias"},{"$f":"IF($AB$6:$AB$80=\"\",\"\",VLOOKUP($AB$6:$AB$80,Spielerliste!$A$1:$C$480,3))","v":"Wolfurt"},82,34,116,4,77,25,102,5,159,59,218,9]
[56,176,"Witschnigg Johann","Lustenau",68,17,85,7,70,17,87,11,138,34,172,18,null,null,null,null,null,null,null,null,null,null,56,268,{"$f":"IF($AB$6:$AB$80=\"\",\"\",VLOOKUP($AB$6:$AB$80,Spielerliste!$A$1:$C$480,2))","v":"Dostal Christian"},{"$f":"IF($AB$6:$AB$80=\"\",\"\",VLOOKUP($AB$6:$AB$80,Spielerliste!$A$1:$C$480,3))","v":"Wolfurt"},73,35,108,1,83,45,128,1,156,80,236,2]
[null,null,null,null,null,null,null,null,null,null,null,null,null,null,null,null,null,null,null,null,null,null,null,null,null,null,57,89,{"$f":"IF($AB$6:$AB$80=\"\",\"\",VLOOKUP($AB$6:$AB$80,Spielerliste!$A$1:$C$480,2))","v":"Schatzmann Robert"},{"$f":"IF($AB$6:$AB$80=\"\",\"\",VLOOKUP($AB$6:$AB$80,Spielerliste!$A$1:$C$480,3))","v":"Götzis"},79,34,113,3,74,34,108,4,153,68,221,7]
[null,null,null,null,null,null,null,null,null,null,null,null,null,null,null,null,null,null,null,null,null,null,null,null,null,null,58,null,{"$f":"IF($AB$6:$AB$80=\"\",\"\",VLOOKUP($AB$6:$AB$80,Spielerliste!$A$1:$C$480,2))","v":""},{"$f":"IF($AB$6:$AB$80=\"\",\"\",VLOOKUP($AB$6:$AB$80,Spielerliste!$A$1:$C$480,3))","v":""},null,{"$f":"AG63-AE63","v":0},null,null,null,{"$f":"AK63-AI63","v":0},null,null,{"$f":"AE63+AI63","v":0},{"$f":"AF63+AJ63","v":0},{"$f":"AG63+AK63","v":0},{"$f":"AH63+AL63","v":0}]
[null,null,null,null,null,null,null,null,null,null,null,null,null,null,null,null,null,null,null,null,null,null,null,null,null,null,59,48,{"$f":"IF($AB$6:$AB$80=\"\",\"\",VLOOKUP($AB$6:$AB$80,Spielerliste!$A$1:$C$480,2))","v":"Kofler Reinhard"},{"$f":"IF($AB$6:$AB$80=\"\",\"\",VLOOKUP($AB$6:$AB$80,Spielerliste!$A$1:$C$480,3))","v":"Dornbirn"},86,27,113,5,72,27,99,6,158,54,212,11]
[null,null,null,null,null,null,null,null,null,null,null,null,null,null,null,null,null,null,null,null,null,null,null,null,null,null,60,40,{"$f":"IF($AB$6:$AB$80=\"\",\"\",VLOOKUP($AB$6:$AB$80,Spielerliste!$A$1:$C$480,2))","v":"Ehgartner Wolfgang"},{"$f":"IF($AB$6:$AB$80=\"\",\"\",VLOOKUP($AB$6:$AB$80,Spielerliste!$A$1:$C$480,3))","v":"Dornbirn"},95,33,128,3,82,41,123,0,177,74,251,3]

{"sheet":"Spielerliste","index":3,"n_rows":481,"n_cols":11,"rows_kept":481,"cut":false,"hidden":true,"merged":[]}
["00:00:00","2019-10-22"]
[1,"Bertsch Gerhard","Bludenz","1957-03-01",{"$f":"LEFT(C2,2)","v":"Bl"},{"$f":"YEAR(D2)","v":1957},2019,"H1","","Bertsch Gerhard H1","Bertsch Gerhard H1"]
[2,"Grundner Adolf","Bludenz","1938-03-31","Bl",{"$f":"YEAR(D3)","v":1938},2019,"","H2","Grundner Adolf H2","Grundner Adolf H2"]
[3,"Battisti Anton","Bludenz","1951-01-02","Bl",{"$f":"YEAR(D4)","v":1951},2019,"H1","","Battisti Anton H1","Battisti Anton H1"]
[4,"Schöner Kurt","Bludenz","1938-12-31","Bl",{"$f":"YEAR(D5)","v":1938},2019,"","H2","Schöner Kurt H2","Schöner Kurt H2"]
[5,"Pröckl Heinrich","Bludenz","1931-10-12","Bl",{"$f":"YEAR(D6)","v":1931},2019,"","H2","Pröckl Heinrich H2","Pröckl Heinrich H2"]
[6,null,null,null,"",null,null,null,null,null," "]
[7,null,null,null,"",null,null,null,null,null," "]
[8,null,null,null,"",null,null,null,null,null," "]
[9,null,null,null,"",null,null,null,null,null," "]
[10,null,null,null,"",null,null,null,null,null," "]
[11,"Berkmann Josef","Bregenz","1956-10-07","Br",{"$f":"YEAR(D12)","v":1956},2019,"H1","","Berkmann Josef H1","Berkmann Josef H1"]
[12,"Buggelsheim Kurt","Bregenz","1954-04-18","Br",1954,2019,"H1","","Buggelsheim Kurt H1","Buggelsheim Kurt H1"]
[13,"Cordin Karl Heinz","Bregenz","1940-07-12","Br",1940,2019,"","H2","Cordin Karl Heinz H2","Cordin Karl Heinz H2"]
[14,"Fischer Peter","Bregenz","1951-04-07","Br",1951,2019,"H1","","Fischer Peter H1","Fischer Peter H1"]
[15,"Giesinger Raimund","Bregenz","1951-11-06","Br",1951,2019,"H1","","Giesinger Raimund H1","Giesinger Raimund H1"]
[16,"Natter Helmut","Bregenz","1938-07-19","Br",1938,2019,"","H2","Natter Helmut H2","Natter Helmut H2"]
[17,"Scheiber Martin","Bregenz","1956-02-21","Br",1956,2019,"H1","","Scheiber Martin H1","Scheiber Martin H1"]
[18,"Schwärzler Herbert","Bregenz","1945-01-19","Br",1945,2019,"","H2","Schwärzler Herbert H2","Schwärzler Herbert H2"]
[19,"Stibitzhofer Karl","Bregenz","1941-05-30","Br",1941,2019,"","H2","Stibitzhofer Karl H2","Stibitzhofer Karl H2"]
[20,null,null,null,""]
[21,null,null,null,""]
[22,null,null,null,"",null,null,null,null,null," "]
[23,null,null,null,"",null,null,null,null,null," "]
[24,null,null,null,"",null,null,null,null,null," "]
[25,null,null,null,"",null,null,null,null,null," "]
[26,"Hepberger Erwin","Bürs","1947-01-02","Bü",{"$f":"YEAR(D27)","v":1947},2019,"","H2","Hepberger Erwin H2","Hepberger Erwin H2"]
[27,"Scherrer Martin","Bürs","1948-11-03","Bü",1948,2019,"","H2","Scherrer Martin H2","Scherrer Martin H2"]
[28,"Stadlmayr Wolfgang","Bürs","1958-05-15","Bü",1958,2019,"H1","","Stadlmayr Wolfgang H1","Stadlmayr Wolfgang H1"]
[29,"Thönig Gilbert","Bürs","1939-05-21","Bü",1939,2019,"","H2","Thönig Gilbert H2","Thönig Gilbert H2"]
[30,"Virag Peter","Bürs","1955-12-20","Bü",1955,2019,"H1","","Virag Peter H1","Virag Peter H1"]
[31,"Voltolini Siegfried","Bürs","1946-10-13","Bü",1946,2019,"","H2","Voltolini Siegfried H2","Voltolini Siegfried H2"]
[32]
[33,null,null,null,"",null,null,null,null,null," "]
[34,null,null,null,"",null,null,null,null,null," "]
[35,null,null,null,"",null,null,null,null,null," "]
[36,"Ausserwinkler Adolf","Dornbirn","1940-05-14","Do",{"$f":"YEAR(D37)","v":1940},2019,"","H2","Ausserwinkler Adolf H2","Ausserwinkler Adolf H2"]
[37,"Berger Hermann","Dornbirn","1954-06-02","Do",1954,2019,"H1","","Berger Hermann H1","Berger Hermann H1"]
[38,"Berger Reinhard","Dornbirn","1952-11-26","Do",1952,2019,"H1","","Berger Reinhard H1","Berger Reinhard H1"]
[39,"Berthold Alfons","Dornbirn","1946-10-10","Do",1946,2019,"","H2","Berthold Alfons H2","Berthold Alfons H2"]
[40,"Ehgartner Wolfgang","Dornbirn","1946-12-17","Do",1946,2019,"","H2","Ehgartner Wolfgang H2","Ehgartner Wolfgang H2"]
[41,"Ender Fritz","Dornbirn","1944-03-22","Do",1944,2019,"","H2","Ender Fritz H2","Ender Fritz H2"]
[42,"Fussenegger Anton","Dornbirn","1942-06-04","Do",1942,2019,"","H2","Fussenegger Anton H2","Fussenegger Anton H2"]
[43,"Gradwohl Josef","Dornbirn","1959-01-17","Do",1959,2019,"H1","","Gradwohl Josef H1","Gradwohl Josef H1"]
[44,"Herceg Niki","Dornbirn","1964-08-08","Do",1964,2019,"H1","","Herceg Niki H1","Herceg Niki H1"]
[45,"Kepe Franz","Dornbirn","1953-11-22","Do",1953,2019,"H1","","Kepe Franz H1","Kepe Franz H1"]
[46,"Kessler Günter","Dornbirn","1964-08-29","Do",1964,2019,"H1","","Kessler Günter H1","Kessler Günter H1"]
[47,"Kezic Blago","Dornbirn","1952-11-23","Do",1952,2019,"H1","","Kezic Blago H1","Kezic Blago H1"]
[48,"Kofler Reinhard","Dornbirn","1946-02-06","Do",1946,2019,"","H2","Kofler Reinhard H2","Kofler Reinhard H2"]
[49,"Köstl Rudolf","Dornbirn","1939-04-13","Do",1939,2019,"","H2","Köstl Rudolf H2","Köstl Rudolf H2"]
[50,"Mennel Elmar","Dornbirn","1956-02-04","Do",1956,2019,"H1","","Mennel Elmar H1","Mennel Elmar H1"]
[51,"Natter Josef","Dornbirn","1940-05-01","Do",1940,2019,"","H2","Natter Josef H2","Natter Josef H2"]
[52,"Schrei Franz","Dornbirn","1940-09-23","Do",1940,2019,"","H2","Schrei Franz H2","Schrei Franz H2"]
[53,"Stuhlpfarer Fritz","Dornbirn","1944-02-19","Do",1944,2019,"","H2","Stuhlpfarer Fritz H2","Stuhlpfarer Fritz H2"]
[54,"Vauce Gottfried","Dornbirn","1959-10-31","Do",1959,2019,"H1","","Vauce Gottfried H1","Vauce Gottfried H1"]
[55,"Winder Josef","Dornbirn","1947-01-09",{"$f":"LEFT(C56,2)","v":"Do"},1947,2019,"","H2","Winder Josef H2","Winder Josef H2"]
[56]
[57]
[58]
[59]
[60]
[61,"Andres Erwin","Feldkirch","1940-10-03",{"$f":"LEFT(C62,2)","v":"Fe"},{"$f":"YEAR(D62)","v":1940},2019,"","H2","Andres Erwin H2","Andres Erwin H2"]
[62,"Fink Reinold","Feldkirch","1947-01-29","Fe",1947,2019,"","H2","Fink Reinold H2","Fink Reinold H2"]
[63,"Kodal Heribert","Feldkirch","1947-03-08","Fe",1947,2019,"","H2","Kodal Heribert H2","Kodal Heribert H2"]
[64,"Kohan György","Feldkirch","1937-04-26","Fe",1937,2019,"","H2","Kohan György H2","Kohan György H2"]
[65,"Maier Paul","Feldkirch","1947-01-24","Fe",1947,2019,"","H2","Maier Paul H2","Maier Paul H2"]
[66,"Mathis Otto","Feldkirch","1947-12-28",{"$f":"LEFT(C67,2)","v":"Fe"},{"$f":"YEAR(D67)","v":1947},2019,"","H2","Mathis Otto H2","Mathis Otto H2"]
[67,"Moser Robert","Feldkirch","1933-01-14","Fe",1933,2019,"","H2","Moser Robert H2","Moser Robert H2"]
[68,"Porod Klaus","Feldkirch","1942-09-12","Fe",1942,2019,"","H2","Porod Klaus H2","Porod Klaus H2"]
[69,"Rüscher Kolumban","Feldkirch","1938-12-12","Fe",1938,2019,"","H2","Rüscher Kolumban H2","Rüscher Kolumban H2"]
[70,"Supper Viktor","Feldkirch","1935-01-12","Fe",1935,2019,"","H2","Supper Viktor H2","Supper Viktor H2"]
[71,"Tammer Eckehart","Feldkirch","1935-05-25","Fe",1935,2019,"","H2","Tammer Eckehart H2","Tammer Eckehart H2"]
[72]
[73,null,null,null,""]
[74,null,null,null,""]
[75,null,null,null,""]
[76]
[77]
[78,null,null,null,""]
[79,null,null,null,""]
[80,null,null,null,""]
[81,"Abram Bruno","Götzis","1938-05-16","Gö",1938,2019,"","H2","Abram Bruno H2","Abram Bruno H2"]
[82,"Einwaller Harald","Götzis","1958-02-27","Gö",1958,2019,"H1","","Einwaller Harald H1","Einwaller Harald H1"]
[83,"Fertschnig Reinhard","Götzis","1956-01-06","Gö",1956,2019,"H1","","Fertschnig Reinhard H1","Fertschnig Reinhard H1"]
[84,"Fröschl Robert","Götzis","1931-08-25","Gö",1931,2019,"","H2","Fröschl Robert H2","Fröschl Robert H2"]
[85,"Hyden Walter","Götzis","1950-06-09","Gö",1950,2019,"H1","","Hyden Walter H1","Hyden Walter H1"]
[86,"Kind Albert","Götzis","1950-11-14","Gö",{"$f":"YEAR(D87)","v":1950},2019,"H1","","Kind Albert H1","Kind Albert H1"]
[87,"Pürstl Richard","Götzis","1951-09-07","Gö",1951,2019,"H1","","Pürstl Richard H1","Pürstl Richard H1"]
[88,"Pürstl Wilfried","Götzis","1950-01-15","Gö",1950,2019,"H1","","Pürstl Wilfried H1","Pürstl Wilfried H1"]
[89,"Schatzmann Robert","Götzis","1949-05-09","Gö",1949,2019,"","H2","Schatzmann Robert H2","Schatzmann Robert H2"]
[90,"Scherz Ernst","Götzis","1952-09-11","Gö",1952,2019,"H1","","Scherz Ernst H1","Scherz Ernst H1"]
[91,null,null,null,""]
[92,null,null,null,""]
[93,null,null,null,""]
[94,null,null,null,""]
[95,null,null,null,"",null,null,null,null,null," "]
[96,"Bickel Manfred","Hard","1940-07-30","Ha",{"$f":"YEAR(D97)","v":1940},2019,"","H2","Bickel Manfred H2","Bickel Manfred H2"]
[97,"Di-Meglio Jean-Luc","Hard","1951-10-13","Ha",1951,2019,"H1","","Di-Meglio Jean-Luc H1","Di-Meglio Jean-Luc H1"]
[98,"Legen Josef","Hard","1944-11-01","Ha",1944,2019,"","H2","Legen Josef H2","Legen Josef H2"]
[99,"Linder Hubert","Hard","1941-11-01","Ha",1941,2019,"","H2","Linder Hubert H2","Linder Hubert H2"]
[100,"Pfanner Klaus","Hard","1954-03-27","Ha",1954,2019,"H1","","Pfanner Klaus H1","Pfanner Klaus H1"]
[101,"Prutsch Franz","Hard","1936-04-09","Ha",1936,2019,"","H2","Prutsch Franz H2","Prutsch Franz H2"]
[102,"Stroy Gerhard","Hard","1935-09-21","Ha",1935,2019,"","H2","Stroy Gerhard H2","Stroy Gerhard H2"]
[103,"Woinesich Reinhard","Hard","1953-11-17","Ha",{"$f":"YEAR(D104)","v":1953},2019,"H1","","Woinesich Reinhard H1","Woinesich Reinhard H1"]
[104,null,null,null,""]
[105,null,null,null,""]
[106,null,null,null,""]
[107,null,null,null,""]
[108,null,null,null,""]
[109,null,null,null,""]
[110,null,null,null,""]
[111,"Cuk Jure","Hohenems","1951-03-14","Ho",1951,2019,"H1","","Cuk Jure H1","Cuk Jure H1"]
[112,"Durakovic Mahmud ","Hohenems","1945-09-15","Ho",1945,2019,"","H2","Durakovic Mahmud  H2","Durakovic Mahmud  H2"]
[113,"Hubinger Reinhard","Hohenems","1952-11-25","Ho",1952,2019,"H1","","Hubinger Reinhard H1","Hubinger Reinhard H1"]
[114,"Luif Kurt","Hohenems","1954-04-27","Ho",1954,2019,"H1","","Luif Kurt H1","Luif Kurt H1"]
[115,"Mitteregger Herbert","Hohenems","1933-08-30","Ho",1933,2019,"","H2","Mitteregger Herbert H2","Mitteregger Herbert H2"]
[116,"Preißl Arnold","Hohenems","1938-09-11","Ho",1938,2019,"","H2","Preißl Arnold H2","Preißl Arnold H2"]
[117,"Prugg Franz","Hohenems","1947-03-06","Ho",1947,2019,"","H2","Prugg Franz H2","Prugg Franz H2"]
[118,"Reissner Ludwig","Hohenems","1940-03-22","Ho",1940,2019,"","H2","Reissner Ludwig H2","Reissner Ludwig H2"]
[119,"Schriebl Günther","Hohenems","1941-10-06","Ho",1941,2019,"","H2","Schriebl Günther H2","Schriebl Günther H2"]
[120,"Ulrich Anton","Hohenems","1939-01-27","Ho",1939,2019,"","H2","Ulrich Anton H2","Ulrich Anton H2"]
[121,"Zugec Anton","Hohenems","1951-04-27","Ho",1951,2019,"H1","","Zugec Anton H1","Zugec Anton H1"]
[122,"Zugec Josef","Hohenems","1950-01-01","Ho",1950,2019,"H1","","Zugec Josef H1","Zugec Josef H1"]
[123,null,null,null,""]
[124,null,null,null,""]
[125,null,null,null,""]
[126,null,null,null,""]
[127,null,null,null,""]
[128,null,null,null,""]
[129,null,null,null,""]
[130,null,null,null,{"$f":"LEFT(C131,2)","v":""}]
[131,"Bolter Mario","Koblach","1967-02-15","Ko",{"$f":"YEAR(D132)","v":1967},2019,"H1","","Bolter Mario H1","Bolter Mario H1"]
[132,"Bottesi Siegfried","Koblach","1940-08-12","Ko",1940,2019,"","H2","Bottesi Siegfried H2","Bottesi Siegfried H2"]
[133,"Egle Norbert","Koblach","1949-10-27","Ko",1949,2019,"","H2","Egle Norbert H2","Egle Norbert H2"]
[134,"Fessler Gerd","Koblach","1956-10-30","Ko",1956,2019,"H1","","Fessler Gerd H1","Fessler Gerd H1"]
[135,"Fleisch Friedl","Koblach","1944-01-24","Ko",1944,2019,"","H2","Fleisch Friedl H2","Fleisch Friedl H2"]
[136,"Grassmugg Josef","Koblach","1961-12-11",{"$f":"LEFT(C137,2)","v":"Ko"},{"$f":"YEAR(D137)","v":1961},2020,"H1","","Grassmugg Josef H1","Grassmugg Josef H1"]
[137,"Haaser Andreas","Koblach","1962-02-17","Ko",1962,2021,"H1","","Haaser Andreas H1","Haaser Andreas H1"]
[138,"Häusle Norbert","Koblach","1954-05-29","Ko",1954,2022,"H1","","Häusle Norbert H1","Häusle Norbert H1"]
[139,"Häusle Reinhold","Koblach","1948-10-13","Ko",1948,2023,"","H2","Häusle Reinhold H2","Häusle Reinhold H2"]
[140,"Hohensinger Franz","Koblach","1946-01-21","Ko",1946,2024,"","H2","Hohensinger Franz H2","Hohensinger Franz H2"]
[141,"Iles Stevan","Koblach","1967-01-24","Ko",1967,2025,"H1","","Iles Stevan H1","Iles Stevan H1"]
[142,"Irovec Viktor","Koblach","1966-12-17","Ko",{"$f":"YEAR(D143)","v":1966},2019,"H1","","Irovec Viktor H1","Irovec Viktor H1"]
[143,"Jaindl Robert","Koblach","1949-11-26","Ko",1949,2019,"","H2","Jaindl Robert H2","Jaindl Robert H2"]
[144,"Marte Bruno","Koblach","1944-12-03","Ko",1944,2019,"","H2","Marte Bruno H2","Marte Bruno H2"]
[145,"Metzler Johann","Koblach","1955-07-08","Ko",1955,2019,"H1","","Metzler Johann H1","Metzler Johann H1"]
[146,"Nikolic Milosav","Koblach","1960-02-02","Ko",{"$f":"YEAR(D147)","v":1960},2019,"H1","","Nikolic Milosav H1","Nikolic Milosav H1"]
[147,"Pieber Anton","Koblach","1937-07-22","Ko",1937,2019,"","H2","Pieber Anton H2","Pieber Anton H2"]
[148,"Schatzer Günther","Koblach","1946-02-23","Ko",1946,2019,"","H2","Schatzer Günther H2","Schatzer Günther H2"]
[149,"Schellhorn Ludwig","Koblach","1943-05-19","Ko",1943,2019,"","H2","Schellhorn Ludwig H2","Schellhorn Ludwig H2"]
[150,"Schuler Hans","Koblach","1946-12-15","Ko",1946,2019,"","H2","Schuler Hans H2","Schuler Hans H2"]
[151,"Tusch Norbert","Koblach","1959-09-23","Ko",1959,2019,"H1","","Tusch Norbert H1","Tusch Norbert H1"]
[152,null,null,null,""]
[153,null,null,null,""]
[154,null,null,null,""]
[155,null,null,null,""]
[156,"Baumgartner Ludwig","Lauterach","1945-08-16","La",1945,2019,"","H2","Baumgartner Ludwig H2","Baumgartner Ludwig H2"]
[157,"Braitsch Wilfried ","Lauterach","1934-02-13","La",1934,2019,"","H2","Braitsch Wilfried  H2","Braitsch Wilfried  H2"]
[158,"Dür Wilfried","Lauterach","1948-01-28","La",1948,2019,"","H2","Dür Wilfried H2","Dür Wilfried H2"]
[159,"Handler Luis","Lauterach","1949-06-21","La",1949,2019,"","H2","Handler Luis H2","Handler Luis H2"]
[160,"Heim Werner","Lauterach","1939-12-09","La",1939,2019,"","H2","Heim Werner H2","Heim Werner H2"]
[161,"Koppler Günter","Lauterach","1947-01-29","La",1947,2019,"","H2","Koppler Günter H2","Koppler Günter H2"]
[162,null,null,null,""]
[163]
[164]
[165]
[166,"Brauchard Johann","Lustenau","1943-10-24","Lu",{"$f":"YEAR(D167)","v":1943},2019,"","H2","Brauchard Johann H2","Brauchard Johann H2"]
[167,"Felder Reinhard","Lustenau","1953-01-01","Lu",1953,2019,"H1","","Felder Reinhard H1","Felder Reinhard H1"]
[168,"Hoos Ferenc","Lustenau","1932-07-18","Lu",1932,2019,"","H2","Hoos Ferenc H2","Hoos Ferenc H2"]
[169,"Isele Kurt","Lustenau","1954-08-25","Lu",1954,2019,"H1","","Isele Kurt H1","Isele Kurt H1"]
[170,"Karitnig Franz","Lustenau","1938-12-09","Lu",1938,2019,"","H2","Karitnig Franz H2","Karitnig Franz H2"]
[171,"Mesotitsch Anton","Lustenau","1949-08-11","Lu",1949,2019,"","H2","Mesotitsch Anton H2","Mesotitsch Anton H2"]
[172,"Millien Karl","Lustenau","1936-11-22","Lu",1936,2019,"","H2","Millien Karl H2","Millien Karl H2"]
[173,"Mosbacher Otmar","Lustenau","1937-10-04","Lu",1937,2019,"","H2","Mosbacher Otmar H2","Mosbacher Otmar H2"]
[174,"Riedmann Werner","Lustenau","1957-03-29","Lu",1957,2019,"H1","","Riedmann Werner H1","Riedmann Werner H1"]
[175,"Trippl Helmut","Lustenau","1939-06-05","Lu",1939,2019,"","H2","Trippl Helmut H2","Trippl Helmut H2"]
[176,"Witschnigg Johann","Lustenau","1947-06-22","Lu",1947,2019,"","H2","Witschnigg Johann H2","Witschnigg Johann H2"]
[177,null,null,null,""]
[178,null,null,null,""]
[179,null,null,null,""]
[180,null,null,null,""]
[181,"Ebenhoch Paul","Mäder","1954-02-16","Mä",{"$f":"YEAR(D182)","v":1954},2019,"H1","","Ebenhoch Paul H1","Ebenhoch Paul H1"]
[182,"Ender Heinrich","Mäder","1951-07-12","Mä",1951,2019,"H1","","Ender Heinrich H1","Ender Heinrich H1"]
[183,"Fischer Wolfgang","Mäder","1949-11-19","Mä",1949,2019,"","H2","Fischer Wolfgang H2","Fischer Wolfgang H2"]
[184,"Heinle Otmar","Mäder","1951-01-14","Mä",1951,2019,"H1","","Heinle Otmar ","Heinle Otmar "]
[185,"Hinteregger Erwin","Mäder","1952-08-28","Mä",1952,2019,"H1","","Hinteregger Erwin H1","Hinteregger Erwin H1"]
[186,"Kofler Siegfried","Mäder","1956-02-13","Mä",1956,2019,"H1","","Kofler Siegfried H1","Kofler Siegfried H1"]
[187,"Kuen Ekke","Mäder","1951-06-06","Mä",1951,2019,"H1","","Kuen Ekke H1","Kuen Ekke H1"]
[188,"Riedmann Wolfgang","Mäder","1955-02-15","Mä",1955,2019,"H1","","Riedmann Wolfg. H1","Riedmann Wolfg. H1"]
[189,"Riedmann Markus","Mäder","1959-11-03","Mä",1959,2019,"H1","","Riedmann Markus H1","Riedmann Markus H1"]
[190,"Riegler Gert","Mäder","1967-11-28","Mä",1967,2019,"H1","","Riegler Gert H1","Riegler Gert H1"]
[191,"Rossmann Alois","Mäder","1941-12-11","Mä",1941,2019,"","H2","Rossmann Alois H2","Rossmann Alois H2"]
[192,"Sandholzer Alfred","Mäder","1951-03-24","Mä",1951,2019,"H1","","Sandholzer Alfred H1","Sandholzer Alfred H1"]
[193,"Vallant Karl","Mäder","1941-10-06","Mä",1941,2019,"","H2","Vallant Karl H2","Vallant Karl H2"]
[194,null,null,null,{"$f":"LEFT(C195,2)","v":""}]
[195]
[196,"Gopp Lothar","Nofels","1938-06-22","No",1938,2019,"","H2","Gopp Lothar H2","Gopp Lothar H2"]
[197,"Lins Josef","Nofels","1946-03-20","No",1946,2019,"","H2","Lins Josef H2","Lins Josef H2"]
[198,"Mair Otmar","Nofels","1952-10-14","No",1952,2019,"H1","","Mair Otmar H1","Mair Otmar H1"]
[199,"Paulitsch Gottfried","Nofels","1960-11-06","No",1960,2019,"H1","","Paulitsch Gottfried H1","Paulitsch Gottfried H1"]
[200,"Peterlunger Valerian","Nofels","1952-10-01","No",1952,2019,"H1","","Peterlunger Valerian H1","Peterlunger Valerian H1"]
[201,"Riesser Josef","Nofels","1949-07-10","No",1949,2019,"","H2","Riesser Josef H2","Riesser Josef H2"]
[202,"Studer Kurt","Nofels","1951-11-01","No",1951,2019,"H1","","Studer Kurt H1","Studer Kurt H1"]
[203,"Unterweger Gerhard","Nofels","1959-10-17","No",1959,2019,"H1","","Unterweger Gerhard H1","Unterweger Gerhard H1"]
[204,null,null,null,""]
[205,null,null,null,""]
[206,null,null,null,""]
[207,null,null,null,""]
[208,null,null,null,""]
[209,null,null,null,""]
[210,null,null,null,""]
[211,"Dreier Fridolin","Rankweil","1940-05-12","Ra",1940,2019,"","H2","Dreier Fridolin H2","Dreier Fridolin H2"]
[212,"Ender Helmut","Rankweil","1935-01-19","Ra",1935,2019,"","H2","Ender Helmut H2","Ender Helmut H2"]
[213,"Fetzel Anton","Rankweil","1942-04-21","Ra",1942,2019,"","H2","Fetzel Anton H2","Fetzel Anton H2"]
[214,"Gächter Peter","Rankweil","1947-07-02","Ra",1947,2019,"","H2","Gächter Peter H2","Gächter Peter H2"]
[215,null,null,null,"",null,null,null,null,null," "]
[216,null,null,null,""]
[217,null,null,null,""]
[218,"Müllauer Ernst","Rankweil","1942-04-21","Ra",{"$f":"YEAR(D219)","v":1942},2019,"","H2","Müllauer Ernst H2","Müllauer Ernst H2"]
[219,"Pattyn Paul","Rankweil","1934-12-16","Ra",1934,2019,"","H2","Pattyn Paul H2","Pattyn Paul H2"]
[220,"Schirgi Wolfgang","Rankweil","1951-03-07","Ra",1951,2019,"H1","","Schirgi Wolfgang H1","Schirgi Wolfgang H1"]
[221,"Simoner Gottfried","Rankweil","1939-08-12","Ra",1939,2019,"","H2","Simoner Gottfried H2","Simoner Gottfried H2"]
[222,null,null,null,""]
[223,null,null,null,""]
[224,null,null,null,""]
[225,null,null,null,""]
[226,"Bastiani Karl","Rheindelta","1950-10-18","Rh",1950,2019,"H1","","Bastiani Karl H1","Bastiani Karl H1"]
[227,"Fetz Hans","Rheindelta","1935-12-01","Rh",1935,2019,"","H2","Fetz Hans H2","Fetz Hans H2"]
[228,"Gobbi Paolo","Rheindelta","1946-05-18","Rh",1946,2019,"","H2","Gobbi Paolo H2","Gobbi Paolo H2"]
[229,"Hummel Franz","Rheindelta","1956-11-30","Rh",1956,2019,"H1","","Hummel Franz H1","Hummel Franz H1"]
[230,"Samide Werner","Rheindelta","1951-09-13","Rh",1951,2019,"H1","","Samide Werner H1","Samide Werner H1"]
[231,"Scheiber Felix","Rheindelta","1940-06-07","Rh",{"$f":"YEAR(D232)","v":1940},2019,"","H2","Scheiber Felix H2","Scheiber Felix H2"]
[232,"Schobel Anton","Rheindelta","1952-09-14","Rh",1952,2019,"H1","","Schobel Anton H1","Schobel Anton H1"]
[233,null,null,null,""]
[234,null,null,null,""]
[235,null,null,null,""]
[236,"Giselbrecht Richard","Vorderwald","1952-05-08","Vo",1952,2019,"H1","","Giselbrecht Richard H1","Giselbrecht Richard H1"]
[237,"Hörmann Peter","Vorderwald","1953-01-01","Vo",1953,2019,"H1","","Hörmann Peter H1","Hörmann Peter H1"]
[238,"Jäger Heinz","Vorderwald","1942-05-14",{"$f":"LEFT(C239,2)","v":"Vo"},{"$f":"YEAR(D239)","v":1942},2019,"","H2","Jäger Heinz H2","Jäger Heinz H2"]
[239,"Moosbrugger Helmut","Vorderwald","1940-02-11","Vo",1940,2019,"","H2","Moosbrugger Helmut H2","Moosbrugger Helmut H2"]
[240,"Schuler Lorenz","Vorderwald","1947-01-26","Vo",1947,2019,"","H2","Schuler Lorenz H2","Schuler Lorenz H2"]
[241,"Unterguggenberger H.","Vorderwald","1945-12-11","Vo",1945,2019,"","H2","Unterguggenberger H. H2","Unterguggenberger H. H2"]
[242,"Vazovec Roman","Vorderwald","1945-02-10","Vo",1945,2019,"","H2","Vazovec Roman H2","Vazovec Roman H2"]
[243]
[244]
[245]
[246,"Bitschnau Emil","Vandans","1950-07-11","Va",{"$f":"YEAR(D247)","v":1950},2019,"H1","","Bitschnau Emil H1","Bitschnau Emil H1"]
[247,"Bodingbauer Herbert","Vandans","1940-06-19",{"$f":"LEFT(C248,2)","v":"Va"},1940,2019,"","H2","Bodingbauer Herbert ","Bodingbauer Herbert "]
[248,"Bolter Manfred","Vandans","1945-02-03",{"$f":"LEFT(C249,2)","v":"Va"},1945,2019,"","H2","Bolter Manfred H2","Bolter Manfred H2"]
[249,"Egle Herbert","Vandans","1945-05-11","Va",1945,2019,"","H2","Egle Herbert H2","Egle Herbert H2"]
[250,"Fritz Erich","Vandans","1957-06-09","Va",1957,2019,"H1","","Fritz Erich H1","Fritz Erich H1"]
[251,"Kleboth Günther","Vandans","1949-10-15","Va",1949,2019,"","H2","Kleboth Günther H2","Kleboth Günther H2"]
[252,"Maier Wilfried","Vandans","1953-03-12","Va",1953,2019,"H1","","Maier Wilfried H1","Maier Wilfried H1"]
[253,"Nägele Anton","Vandans","1943-12-24","Va",1943,2019,"","H2","Nägele Anton H2","Nägele Anton H2"]
[254,"Peter August","Vandans","1932-06-17","Va",1932,2019,"","H2","Peter August H2","Peter August H2"]
[255,"Schwarzendahl Dieter","Vandans","1948-10-08","Va",1948,2019,"","H2","Schwarzendahl Dieter H2","Schwarzendahl Dieter H2"]
[256,"Simenowskyj Stefan","Vandans","1956-03-29","Va",1956,2019,"H1","","Simenowskyj Stefan H1","Simenowskyj Stefan H1"]
[257,"Stemer Klemens","Vandans","1950-04-24","Va",1950,2019,"H1","","Stemer Klemens H1","Stemer Klemens H1"]
[258,"Ströhle Helmut","Vandans","1950-06-28","Va",1950,2019,"H1","","Ströhle Helmut H1","Ströhle Helmut H1"]
[259,"Trummer Heinz","Vandans","1954-02-07","Va",1954,2019,"H1","","Trummer Heinz H1","Trummer Heinz H1"]
[260,"Valentin Gerhard","Vandans","1959-06-28","Va",1959,2019,"H1","","Valentin Gerhard H1","Valentin Gerhard H1"]
[261,"Wachter Robert","Vandans","1959-02-22","Va",1959,2019,"H1","","Wachter Robert H1","Wachter Robert H1"]
[262,null,null,null,""]
[263,null,null,null,""]
[264,null,null,null,""]
[265,null,null,null,""]
[266,"Bargehr Kurt","Wolfurt","1948-03-28","Wo",{"$f":"YEAR(D267)","v":1948},2019,"","H2","Bargehr Kurt H2","Bargehr Kurt H2"]
[267,"Bischelsberger Helmut","Wolfurt","1945-06-27","Wo",1945,2019,"","H2","Bischelsberger Helmut H2","Bischelsberger Helmut H2"]
[268,"Dostal Christian","Wolfurt","1947-06-01","Wo",1947,2019,"","H2","Dostal Christian H2","Dostal Christian H2"]
[269,"Florineth Bruno","Wolfurt","1953-01-10","Wo",1953,2019,"H1","","Florineth Bruno H1","Florineth Bruno H1"]
[270,"Lick Max","Wolfurt","1946-10-08","Wo",1946,2019,"","H2","Lick Max H2","Lick Max H2"]
[271,"Maier Josef","Wolfurt","1954-12-19","Wo",1954,2019,"H1","","Maier Josef H1","Maier Josef H1"]
[272,"Moser Mathias","Wolfurt","1937-01-24","Wo",1937,2019,"","H2","Moser Mathias H2","Moser Mathias H2"]
[273,"Wiesflecker Edi","Wolfurt","1953-05-29","Wo",1953,2019,"H1","","Wiesflecker Edi H1","Wiesflecker Edi H1"]
[274,"Wipplinger Hubert","Wolfurt","1940-09-25","Wo",1940,2019,"","H2","Wipplinger Hubert H2","Wipplinger Hubert H2"]
[275,"Wolf Othmar","Wolfurt","1948-09-18",{"$f":"LEFT(C276,2)","v":"Wo"},{"$f":"YEAR(D276)","v":1948},2019,"","H2","Wolf Othmar H2","Wolf Othmar H2"]
[276]
[277]
[278]
[279]
[280]
[281,"Brichaz Franz","ESV Br-Wo","1940-08-17","ES",{"$f":"YEAR(D282)","v":1940},2019,"","H2","Brichaz Franz H2","Brichaz Franz H2"]
[282,"Marinz Günther","ESV Br-Wo","1969-06-06","ES",1969,2019,"H1","","Marint Günther H1","Marint Günther H1"]
[283,"Riemer Herbert","ESV Br-Wo","1957-05-09","ES",1957,2019,"H1","","Riemer Herbert H1","Riemer Herbert H1"]
[284,null,null,null,""]
[285,null,null,null,""]
[286,null,null,null,""]
[287,null,null,null,""]
[288,null,null,null,""]
[289,null,null,null,""]
[290,null,null,null,""]
[291,"Klinger Franz","Partenen","1935-01-20","Pa",{"$f":"YEAR(D292)","v":1935},2019,"","H2","Klinger Franz H2","Klinger Franz H2"]
[292,"Munz Karl","Partenen","1951-10-06","Pa",1951,2019,"H1","","Munz Karl H1","Munz Karl H1"]
[293,"Pachole Bruno","Partenen","1940-04-12","Pa",1940,2019,"","H2","Pachole Bruno H2","Pachole Bruno H2"]
[294,"Werle Karl","Partenen","1931-01-09","Pa",1931,2019,"","H2","Werle Karl H2","Werle Karl H2"]
[295,null,null,null,""]
[296,null,null,null,""]
[297,null,null,null,""]
[298,null,null,null,""]
[299,null,null,null,""]
[300,null,null,null,""]
[301,"Gassner Siglinde","Bludenz","1939-08-19","Bl",null,2019,null,null,null,"Gassner Siglinde"]
[302,"Herunter Monika","Bludenz","1941-08-06","Bl",null,2019,null,null,null,"Herunter Monika"]
[303,"Podusel Renate","Bludenz","1942-12-18","Bl",null,2019,null,null,null,"Podusel Renate"]
[304,"Schuler Lotte","Bludenz","1942-03-29","Bl",null,2019,null,null,null,"Schuler Lotte"]
[305,null,null,null,"",null,2019]
[306,null,null,null,"",null,2019]
[307,null,null,null,"",null,2019]
[308,null,null,null,"",null,2019]
[309,null,null,null,"",null,2019]
[310,null,null,null,"",null,2019]
[311,"Giesinger Elisabeth","Bregenz","1954-03-03","Br",null,2019,null,null,null,"Giesinger Elisabeth"]
[312,"Höfle Blanka","Bregenz","1948-05-05",{"$f":"LEFT(C313,2)","v":"Br"},null,2019,null,null,null,"Höfle Blanka"]
[313,"Moosbrugger Elfriede","Bregenz","1941-09-21","Br",null,2019,null,null,null,"Moosbrugger Elfriede"]
[314,"Schneider Steffi","Bregenz","1949-12-26","Br",null,2019,null,null,null,"Schneider Steffi"]
[315,"Schwärzler Ulrike","Bregenz","1956-08-07","Br",null,2019,null,null,null,"Schwärzler Ulrike"]
[316,null,null,null,"",null,2019]
[317,null,null,null,"",null,2019]
[318,null,null,null,"",null,2019]
[319,null,null,null,"",null,2019]
[320,null,null,null,"",null,2019]
[321,"Hepberger Monika","Bürs","1949-01-24","Bü",null,2019,null,null,null,"Hepberger Monika"]
[322,"Leimgruber Roswitha","Bürs","1946-05-31","Bü",null,2019,null,null,null,"Leimgruber Roswitha"]
[323,"Pfeifer Gertrud","Bürs","1941-03-10","Bü",null,2019,null,null,null,"Pfeifer Gertrud"]
[324,"Scherrer Luise","Bürs","1951-01-21","Bü",null,2019,null,null,null,"Scherrer Luise"]
[325,"Stadlmayr Yvonne","Bürs","1958-09-02","Bü",null,2019,null,null,null,"Stadlmayr Yvonne"]
[326,"Witting Magdalena","Bürs","1938-04-10","Bü",null,2019,null,null,null,"Witting Magdalena"]
[327,null,null,null,"",null,2019]
[328,null,null,null,"",null,2019]
[329,null,null,null,"",null,2019]
[330,null,null,null,"",null,2019]
[331,"Kofler Christine","Dornbirn","1947-11-09","Do",null,2019,null,null,null,"Kofler Christine"]
[332,"Kuncic Eleonora","Dornbirn","1951-02-15","Do",null,2019,null,null,null,"Kuncic Eleonora"]
[333,"Mayr Ernestine","Dornbirn","1953-11-06","Do",null,2019,null,null,null,"Mayr Ernestine"]
[334,"Oblak Heidi","Dornbirn","1960-06-01","Do",null,2019,null,null,null,"Oblak Heidi"]
[335,"Ruprecht Herta","Dornbirn","1940-01-18","Do",null,2019,null,null,null,"Ruprecht Herta"]
[336,"Schrei Elfriede","Dornbirn","1948-06-24","Do",null,2019,null,null,null,"Schrei Elfriede"]
[337,"Seidler Elisabeth","Dornbirn","1951-08-23","Do",null,2019,null,null,null,"Seidler Elisabeth"]
[338,null,null,null,"",null,2019]
[339,null,null,null,"",null,2019]
[340,null,null,null,"",null,2019]
[341,"Getsch Lotte","Feldkirch","1941-06-30","Fe",null,2019,null,null,null,"Getsch Lotte"]
[342,"Heiss Anni","Feldkirch","1941-08-10","Fe",null,2019,null,null,null,"Heiss Anni"]
[343,"Speckle Irene","Feldkirch","1949-02-19","Fe",null,2019,null,null,null,"Speckle Irene"]
[344,"Stuhl Theresia","Feldkirch","1938-10-24","Fe",null,2019,null,null,null,"Stuhl Theresia"]
[345,"Wehinger Hannelore","Feldkirch","1941-06-23","Fe",null,2019,null,null,null,"Wehinger Hannelore"]
[346,null,null,null,"",null,2019]
[347,null,null,null,"",null,2019]
[348,null,null,null,"",null,2019]
[349,null,null,null,"",null,2019]
[350,null,null,null,"",null,2019]
[351,"Abram Renate","Götzis","1945-11-09","Gö",null,2019,null,null,null,"Abram Renate"]
[352,"Mally Marlene","Götzis","1957-05-03","Gö",null,2019,null,null,null,"Mally Marlene"]
[353,"Schatzmann Doris","Götzis","1953-12-16","Gö",null,2019,null,null,null,"Schatzmann Doris"]
[354,"Scherz Christine","Götzis","1953-02-19","Gö",null,2019,null,null,null,"Scherz Christine"]
[355,"Theiner Elfriede","Götzis","1946-10-31","Gö",null,2019,null,null,null,"Theiner Elfriede"]
[356,null,null,null,"",null,2019]
[357,null,null,null,"",null,2019]
[358,null,null,null,"",null,2019]
[359,null,null,null,"",null,2019]
[360,null,null,null,"",null,2019]
[361,"Di-Meglio Gerda","Hard","1953-12-28","Ha",null,2019,null,null,null,"Di-Meglio Gerda"]
[362,"Stroy Luzia","Hard","1940-02-15","Ha",null,2019,null,null,null,"Stroy Luzia"]
[363,"Woinesich Eva","Hard","1954-05-03","Ha",null,2019,null,null,null,"Woinesich Eva"]
[364,null,null,null,"",null,2019]
[365,null,null,null,"",null,2019]
[366,null,null,null,"",null,2019]
[367,null,null,null,"",null,2019]
[368,null,null,null,"",null,2019]
[369,null,null,null,"",null,2019]
[370,null,null,null,"",null,2019]
[371,"Bolter Regina","Koblach","1950-09-02","Ko",null,2019,null,null,null,"Bolter Regina"]
[372,"Fessler Renate","Koblach","1956-02-20","Ko",null,2019,null,null,null,"Fessler Renate"]
[373,"Hämmerle Sabine","Koblach","1958-01-22","Ko",null,2019,null,null,null,"Hämmerle Sabine"]
[374,"Hohensinger Heidi","Koblach","1951-05-15","Ko",null,2019,null,null,null,"Hohensinger Heidi"]
[375,"Schuler Sieglinde","Koblach","1950-12-09","Ko",null,2019,null,null,null,"Schuler Sieglinde"]
[376,null,null,null,{"$f":"LEFT(C377,2)","v":""},null,2019]
[377,null,null,null,"",null,2019]
[378,null,null,null,"",null,2019]
[379,null,null,null,"",null,2019]
[380,null,null,null,"",null,2019]
[381,"Braitsch Erna","Lauterach","1934-11-05","La",null,2019,null,null,null,"Braitsch Erna"]
[382,"Gufler Erika ","Lauterach","1940-07-21","La",null,2019,null,null,null,"Gufler Erika "]
[383,null,null,null,"",null,2019]
[384,null,null,null,"",null,2019]
[385,null,null,null,"",null,2019]
[386,"Bürgmann  Fini","Lustenau","1935-03-19","Lu",null,2019,null,null,null,"Bürgmann  Fini"]
[387,"Fessler Hildegard","Lustenau","1936-08-18","Lu",null,2019,null,null,null,"Fessler Hildegard"]
[388,"Isele Heidi","Lustenau","1957-07-26","Lu",null,2019,null,null,null,"Isele Heidi"]
[389,"Loidl Josefine","Lustenau","1940-03-20","Lu",null,2019,null,null,null,"Loidl Josefine"]
[390,"Mesotitsch Rosmarie","Lustenau","1939-11-01","Lu",null,2019,null,null,null,"Mesotitsch Rosmarie"]
[391,"Salzmann Elvira","Lustenau","1953-01-25","Lu",null,2019,null,null,null,"Salzmann Elvira"]
[392,"Schelling Hedi","Lustenau","1959-03-09","Lu",null,2019,null,null,null,"Schelling Hedi"]
[393,"Stipetic Marija","Lustenau","1942-09-29","Lu",null,2019,null,null,null,"Stipetic Marija"]
[394,null,null,null,"",null,2019]
[395,null,null,null,"",null,2019]
[396,"Böckle Monika","Mäder","1960-06-04","Mä",null,2019,null,null,null,"Böckle Monika"]
[397,"Ebenhoch Monika","Mäder","1951-04-05","Mä",null,2019,null,null,null,"Ebenhoch Monika"]
[398,"Fischer Liliane","Mäder","1954-12-06","Mä",null,2019,null,null,null,"Fischer Liliane"]
[399,"Hinteregger Steffi","Mäder","1956-06-26","Mä",null,2019,null,null,null,"Hinteregger Steffi"]
[400,"Klucker Liliane","Mäder","1954-12-06","Mä",null,2019,null,null,null,"Klucker Liliane"]
[401,"Lindner Margit","Mäder","1944-07-24","Mä",null,2019,null,null,null,"Lindner Margit"]
[402,"Stiegler Silvia","Mäder","1966-06-12","Mä",null,2019,null,null,null,"Stiegler Silvia"]
[403,"Stracker Anna","Mäder","1950-06-28","Mä",null,2019,null,null,null,"Stracker Anna"]
[404,null,null,null,"",null,2019]
[405,null,null,null,"",null,2019]
[406,null,null,null,"",null,2019]
[407,null,null,null,"",null,2019]
[408,null,null,null,"",null,2019]
[409,null,null,null,"",null,2019]
[410,null,null,null,"",null,2019]
[411,"Lins Ruth","Nofels","1951-02-12","No",null,2019,null,null,null,"Lins Ruth"]
[412,"Mair Wilma","Nofels","1955-12-16","No",null,2019,null,null,null,"Mair Wilma"]
[413,"Müller Hildegard","Nofels","1950-09-16","No",null,2019,null,null,null,"Müller Hildegard"]
[414,"Paulitsch Klaudia","Nofels","1963-06-22","No",null,2019,null,null,null,"Paulitsch Klaudia"]
[415,"Peterlunger Eliana","Nofels","1956-01-12","No",null,2019,null,null,null,"Peterlunger Eliana"]
[416,"Wirtensohn Elisabeth","Nofels","1938-08-29","No",null,2019,null,null,null,"Wirtensohn Elisabeth"]
[417,null,null,null,"",null,2019]
[418,null,null,null,"",null,2019]
[419,null,null,null,"",null,2019]
[420,null,null,null,"",null,2019]
[421,"Knobel Herlinde","Rankweil","1958-04-24","Ra",null,2019,null,null,null,"Knobel Herlinde"]
[422,"Mitiska Evi","Rankweil","1933-03-16","Ra",null,2019,null,null,null,"Mitiska Evi"]
[423,null,null,null,"",null,2019]
[424,null,null,null,"",null,2019]
[425,null,null,null,"",null,2019]
[426,"Bernard Hilde","Rheindelta","1937-12-03","Rh",null,2019,null,null,null,"Bernard Hilde"]
[427,"Car Herta","Rheindelta","1942-02-25","Rh",null,2019,null,null,null,"Car Herta"]
[428,"Gobbi Erika","Rheindelta","1946-12-09","Rh",null,2019,null,null,null,"Gobbi Erika"]
[429,"Nedok Manuela","Rheindelta","1960-09-13","Rh",null,2019,null,null,null,"Nedok Manuela"]
[430,"Schobel Monika","Rheindelta","1958-08-11","Rh",null,2019,null,null,null,"Schobel Monika"]
[431,"Stückler Hermi","Rheindelta","1939-12-24","Rh",null,2019,null,null,null,"Stückler Hermi"]
[432,null,null,null,"",null,2019]
[433,null,null,null,"",null,2019]
[434,null,null,null,"",null,2019]
[435,null,null,null,"",null,2019]
[436,"Bitschnau Ursula","Vandans","1951-10-10","Va",null,2019,null,null,null,"Bitschnau Ursula"]
[437,"Fritz Karin","Vandans","1959-01-27","Va",null,2019,null,null,null,"Fritz Karin"]
[438,"Kasper Traudl","Vandans","1950-05-27","Va",null,2019,null,null,null,"Kasper Traudl"]
[439,"Maier Annemarie","Vandans","1954-01-01","Va",null,2019,null,null,null,"Maier Annemarie"]
[440,"Mangeng Tamara","Vandans","1953-04-30",{"$f":"LEFT(C441,2)","v":"Va"},null,2019,null,null,null,"Mangeng Tamara"]
[441,"Salzgeber  Margret","Vandans","1942-01-01","Va",null,2019,null,null,null,"Salzgeber  Margret"]
[442,"Sinko Lotte","Vandans","1956-01-01","Va",null,2019,null,null,null,"Sinko Lotte"]
[443,"Ströhle Renate","Vandans","1955-01-01","Va",null,2019,null,null,null,"Ströhle Renate"]
[444,null,null,null,"",null,2019]
[445,null,null,null,"",null,2019]
[446,"Berkmann Monika","Vorderwald","1957-02-28","Vo",null,2019,null,null,null,"Berkmann Monika"]
[447,null,null,null,"",null,2019]
[448,null,null,null,"",null,2019]
[449,null,null,null,"",null,2019]
[450,null,null,null,"",null,2019]
[451,"Gutmann Lore","Wolfurt","1949-02-01","Wo",null,2019,null,null,null,"Gutmann Lore"]
[452,"Lick Brunhilde","Wolfurt","1945-04-06","Wo",null,2019,null,null,null,"Lick Brunhilde"]
[453,"Novak Rosa","Wolfurt","1945-06-10","Wo",null,2019,null,null,null,"Novak Rosa"]
[454,null,null,null,"",null,2019]
[455,null,null,null,"",null,2019]
[456,null,null,null,"",null,2019]
[457,null,null,null,"",null,2019]
[458,null,null,null,"",null,2019]
[459,null,null,null,"",null,2019]
[460,null,null,null,"",null,2019]
[461,"Kohler Brigitte","ESV Br-Wo","1960-03-14","ES",null,2019,null,null,null,"Kohler Brigitte"]
[462,"Kuschny Maria","ESV Br-Wo","1953-11-29","ES",null,2019,null,null,null,"Kuschny Maria"]
[463,"Nussbaumer Anny","ESV Br-Wo","1956-06-28","ES",null,2019,null,null,null,"Nussbaumer Anny"]
[464,"Schaarschmidt Heidemarie","ESV Br-Wo","1953-11-30",null,null,2019,null,null,null,"Schaarschmidt Heidemarie"]
[465,"Weinmüller Karin","ESV Br-Wo","1955-10-17",null,null,2019,null,null,null,"Weinmüller Karin"]
[466,null,null,null,{"$f":"LEFT(C467,2)","v":""},null,2019]
[467,null,null,null,"",null,2019]
[468,null,null,null,"",null,2019]
[469,null,null,null,"",null,2019]
[470,null,null,null,"",null,2019]
[471,"Bitschnau Gerti","Partenen","1944-03-08","Pa",null,2019,null,null,null,"Bitschnau Gerti"]
[472,"Klinger Inge","Partenen","1942-06-27","Pa",null,2019,null,null,null,"Klinger Inge"]
[473,"Munz Renate","Partenen","1956-01-14","Pa",null,2019,null,null,null,"Munz Renate"]
[474,"Werle Elisabeth","Partenen","1957-12-12","Pa",null,2019,null,null,null,"Werle Elisabeth"]
[475,"Stemer Marianne","Partenen","1943-02-02","Pa",null,2019,null,null,null,"Stemer Marianne"]
[476,null,null,null,"",null,2019]
[477,null,null,null,"",null,2019]
[478,null,null,null,"",null,2019]
[479,null,null,null,"",null,2019]
[480,null,null,null,null,null,2019]

{"sheet":"Tabelle1","index":4,"n_rows":5,"n_cols":1,"rows_kept":5,"cut":false,"hidden":true,"merged":[]}
[]
[]
[]
["Neigungsgruppe Kegeln"]
["Einzelmeisterschaft  2012/13"]