{"text_format":"1","workbook":"xlsx","n_sheets":5,"sheets":["EM 60 Wurf Damen","EM 60 Wurf Herren 1","EM 60 Wurf Herren 2","Spielerliste","Tabelle1"],"not_rendered":{"charts":0,"images":9,"macros":1,"external_links":0,"defined_names":9,"comments":0,"pivot_tables":0},"unopened":[],"bounds":{"document_bytes":16777216,"sheet_cells":100000,"rows_first":2000,"rows_last":500,"rows_between":2000,"halvings":0,"cell_chars":16384,"cell_head_chars":4096},"cells_cut":0,"cells_raw":0,"read":"whole","date_system":"1900"}

{"sheet":"EM 60 Wurf Damen","index":0,"n_rows":63,"n_cols":42,"rows_kept":63,"cut":false,"hidden":false,"merged":[[0,0,0,15],[1,0,1,15],[3,0,4,0],[3,1,4,1],[3,2,4,2],[3,3,4,3],[3,4,3,7],[3,8,3,11],[3,12,4,12],[3,13,4,13],[3,14,4,14],[3,15,4,15],[3,40,4,40],[3,41,4,41],[0,26,0,41],[1,26,1,41],[3,26,4,26],[3,27,4,27],[3,28,4,28],[3,29,4,29],[3,30,3,33],[3,34,3,37],[3,38,4,38],[3,39,4,39]]}
["60 Wurf - Einzelmeisterschaft  2019/20",null,null,null,null,null,null,null,null,null,null,null,null,null,null,null,null,null,null,null,null,null,null,null,null,null,"Einzelmeisterschaft  2019/20"]
["Ergebnisliste - DAMEN",null,null,null,null,null,null,null,null,null,null,null,null,null,null,null,null,null,null,null,null,null,null,null,null,null,"Ergebnisliste - DAMEN"]
[]
["Pl.",null,"Name","Ortsgr.","1. Durchgang",null,null,null,"2. Durchgang",null,null,null,"Volle","Abr","Ges","FW",null,null,null,null,null,null,null,null,null,null,null,null,"Name","Ortsgr.","1. Durchgang",null,null,null,"2. Durchgang",null,null,null,"Volle","Abr","Ges","FW"]
[null,null,null,null,"V","A","G","FW","V","A","G","FW",null,null,null,null,null,null,null,null,null,null,null,null,null,null,null,null,null,null,"V","A","G","FW","V","A","G","FW"]
[1,331,"Kofler Christine","Dornbirn",88,45,133,0,83,33,116,3,171,78,249,3,null,null,null,null,null,null,null,null,null,null,1,463,{"$f":"IF($AB$6:$AB$29=\"\",\"\",VLOOKUP($AB$6:$AB$29,Spielerliste!$A$1:$C$480,2))","v":"Nussbaumer Anny"},{"$f":"IF($AB$6:$AB$29=\"\",\"\",VLOOKUP($AB$6:$AB$29,Spielerliste!$A$1:$C$480,3))","v":"ESV Br-Wo"},71,{"$f":"AG6-AE6","v":26},97,8,87,{"$f":"AK6-AI6","v":25},112,6,{"$f":"AE6+AI6","v":158},{"$f":"AF6+AJ6","v":51},{"$f":"AG6+AK6","v":209},{"$f":"AH6+AL6","v":14}]
[2,439,"Maier Annemarie","Vandans",82,35,117,2,89,42,131,3,171,77,248,5,null,null,null,null,null,null,null,null,null,null,2,465,{"$f":"IF($AB$6:$AB$29=\"\",\"\",VLOOKUP($AB$6:$AB$29,Spielerliste!$A$1:$C$480,2))","v":"Weinmüller Karin"},{"$f":"IF($AB$6:$AB$29=\"\",\"\",VLOOKUP($AB$6:$AB$29,Spielerliste!$A$1:$C$480,3))","v":"ESV Br-Wo"},77,33,110,4,73,24,97,4,150,57,207,8]
[3,373,"Hämmerle Sabine","Koblach",84,53,137,1,75,35,110,4,159,88,247,5,null,null,null,null,null,null,null,null,null,null,3,387,{"$f":"IF($AB$6:$AB$29=\"\",\"\",VLOOKUP($AB$6:$AB$29,Spielerliste!$A$1:$C$480,2))","v":"Fessler Hildegard"},{"$f":"IF($AB$6:$AB$29=\"\",\"\",VLOOKUP($AB$6:$AB$29,Spielerliste!$A$1:$C$480,3))","v":"Lustenau"},65,35,100,6,71,33,104,2,136,68,204,8]
[4,413,"Müller Hildegard","Nofels",92,26,118,4,94,35,129,3,186,61,247,7,null,null,null,null,null,null,null,null,null,null,4,389,{"$f":"IF($AB$6:$AB$29=\"\",\"\",VLOOKUP($AB$6:$AB$29,Spielerliste!$A$1:$C$480,2))","v":"Loidl Josefine"},{"$f":"IF($AB$6:$AB$29=\"\",\"\",VLOOKUP($AB$6:$AB$29,Spielerliste!$A$1:$C$480,3))","v":"Lustenau"},81,17,98,10,78,17,95,9,159,34,193,19]
[5,324,"Scherrer Luise","Bürs",86,35,121,2,87,35,122,1,173,70,243,3,null,null,null,null,null,null,null,null,null,null,5,391,{"$f":"IF($AB$6:$AB$29=\"\",\"\",VLOOKUP($AB$6:$AB$29,Spielerliste!$A$1:$C$480,2))","v":"Salzmann Elvira"},{"$f":"IF($AB$6:$AB$29=\"\",\"\",VLOOKUP($AB$6:$AB$29,Spielerliste!$A$1:$C$480,3))","v":"Lustenau"},86,18,104,7,79,25,104,5,165,43,208,12]
[6,401,"Lindner Margit","Mäder",79,49,128,2,79,35,114,2,158,84,242,4,null,null,null,null,null,null,null,null,null,null,6,392,{"$f":"IF($AB$6:$AB$29=\"\",\"\",VLOOKUP($AB$6:$AB$29,Spielerliste!$A$1:$C$480,2))","v":"Schelling Hedi"},{"$f":"IF($AB$6:$AB$29=\"\",\"\",VLOOKUP($AB$6:$AB$29,Spielerliste!$A$1:$C$480,3))","v":"Lustenau"},83,25,108,5,79,48,127,0,162,73,235,5]
[7,451,"Gutmann Lore","Wolfurt",76,43,119,1,87,35,122,2,163,78,241,3,null,null,null,null,null,null,null,null,null,null,7,355,{"$f":"IF($AB$6:$AB$29=\"\",\"\",VLOOKUP($AB$6:$AB$29,Spielerliste!$A$1:$C$480,2))","v":"Theiner Elfriede"},{"$f":"IF($AB$6:$AB$29=\"\",\"\",VLOOKUP($AB$6:$AB$29,Spielerliste!$A$1:$C$480,3))","v":"Götzis"},82,35,117,3,77,35,112,3,159,70,229,6]
[8,314,"Schneider Steffi","Bregenz",86,36,122,1,82,34,116,2,168,70,238,3,null,null,null,null,null,null,null,null,null,null,8,354,{"$f":"IF($AB$6:$AB$29=\"\",\"\",VLOOKUP($AB$6:$AB$29,Spielerliste!$A$1:$C$480,2))","v":"Scherz Christine"},{"$f":"IF($AB$6:$AB$29=\"\",\"\",VLOOKUP($AB$6:$AB$29,Spielerliste!$A$1:$C$480,3))","v":"Götzis"},76,27,103,5,76,25,101,6,152,52,204,11]
[9,393,"Stipetic Marija","Lustenau",81,30,111,5,91,34,125,2,172,64,236,7,null,null,null,null,null,null,null,null,null,null,9,352,{"$f":"IF($AB$6:$AB$29=\"\",\"\",VLOOKUP($AB$6:$AB$29,Spielerliste!$A$1:$C$480,2))","v":"Mally Marlene"},{"$f":"IF($AB$6:$AB$29=\"\",\"\",VLOOKUP($AB$6:$AB$29,Spielerliste!$A$1:$C$480,3))","v":"Götzis"},74,42,116,1,72,27,99,4,146,69,215,5]
[10,392,"Schelling Hedi","Lustenau",83,25,108,5,79,48,127,0,162,73,235,5,null,null,null,null,null,null,null,null,null,null,10,472,{"$f":"IF($AB$6:$AB$29=\"\",\"\",VLOOKUP($AB$6:$AB$29,Spielerliste!$A$1:$C$480,2))","v":"Klinger Inge"},{"$f":"IF($AB$6:$AB$29=\"\",\"\",VLOOKUP($AB$6:$AB$29,Spielerliste!$A$1:$C$480,3))","v":"Partenen"},81,34,115,2,56,33,89,4,137,67,204,6]
[11,428,"Gobbi Erika","Rheindelta",85,35,120,3,88,27,115,3,173,62,235,6,null,null,null,null,null,null,null,null,null,null,11,475,{"$f":"IF($AB$6:$AB$29=\"\",\"\",VLOOKUP($AB$6:$AB$29,Spielerliste!$A$1:$C$480,2))","v":"Stemer Marianne"},{"$f":"IF($AB$6:$AB$29=\"\",\"\",VLOOKUP($AB$6:$AB$29,Spielerliste!$A$1:$C$480,3))","v":"Partenen"},67,26,93,5,70,34,104,4,137,60,197,9]
[12,443,"Ströhle Renate","Vandans",82,26,108,5,84,42,126,3,166,68,234,8,null,null,null,null,null,null,null,null,null,null,12,473,{"$f":"IF($AB$6:$AB$29=\"\",\"\",VLOOKUP($AB$6:$AB$29,Spielerliste!$A$1:$C$480,2))","v":"Munz Renate"},{"$f":"IF($AB$6:$AB$29=\"\",\"\",VLOOKUP($AB$6:$AB$29,Spielerliste!$A$1:$C$480,3))","v":"Partenen"},65,26,91,6,73,41,114,1,138,67,205,7]
[13,343,"Speckle Irene","Feldkirch",92,24,116,5,81,36,117,1,173,60,233,6,null,null,null,null,null,null,null,null,null,null,13,471,{"$f":"IF($AB$6:$AB$29=\"\",\"\",VLOOKUP($AB$6:$AB$29,Spielerliste!$A$1:$C$480,2))","v":"Bitschnau Gerti"},{"$f":"IF($AB$6:$AB$29=\"\",\"\",VLOOKUP($AB$6:$AB$29,Spielerliste!$A$1:$C$480,3))","v":"Partenen"},49,9,58,12,75,13,88,9,124,22,146,21]
[14,355,"Theiner Elfriede","Götzis",82,35,117,3,77,35,112,3,159,70,229,6,null,null,null,null,null,null,null,null,null,null,14,436,{"$f":"IF($AB$6:$AB$29=\"\",\"\",VLOOKUP($AB$6:$AB$29,Spielerliste!$A$1:$C$480,2))","v":"Bitschnau Ursula"},{"$f":"IF($AB$6:$AB$29=\"\",\"\",VLOOKUP($AB$6:$AB$29,Spielerliste!$A$1:$C$480,3))","v":"Vandans"},86,26,112,5,73,43,116,3,159,69,228,8]
[15,436,"Bitschnau Ursula","Vandans",86,26,112,5,73,43,116,3,159,69,228,8,null,null,null,null,null,null,null,null,null,null,15,439,{"$f":"IF($AB$6:$AB$29=\"\",\"\",VLOOKUP($AB$6:$AB$29,Spielerliste!$A$1:$C$480,2))","v":"Maier Annemarie"},{"$f":"IF($AB$6:$AB$29=\"\",\"\",VLOOKUP($AB$6:$AB$29,Spielerliste!$A$1:$C$480,3))","v":"Vandans"},82,35,117,2,89,42,131,3,171,77,248,5]
{"$rows_left_out":44}
{"sheet":"EM 60 Wurf Herren 1","index":1,"n_rows":60,"n_cols":42,"rows_kept":60,"cut":false,"hidden":false,"merged":[[3,3,4,3],[3,4,3,7],[3,8,3,11],[3,12,4,12],[0,0,0,15],[1,0,1,15],[3,0,4,0],[3,1,4,1],[3,2,4,2],[3,13,4,13],[3,14,4,14],[3,15,4,15],[3,40,4,40],[3,41,4,41],[0,26,0,41],[1,26,1,41],[3,26,4,26],[3,27,4,27],[3,28,4,28],[3,29,4,29],[3,30,3,33],[3,34,3,37],[3,38,4,38],[3,39,4,39]]}
["60 Wurf - Einzelmeisterschaft  2019/20",null,null,null,null,null,null,null,null,null,null,null,null,null,null,null,null,null,null,null,null,null,null,null,null,null,"Einzelmeisterschaft  2019/20"]
["Ergebnisliste - HERREN 1",null,null,null,null,null,null,null,null,null,null,null,null,null,null,null,null,null,null,null,null,null,null,null,null,null,"Ergebnisliste - HERREN 1"]
[]
["Pl.",null,"Name","Ortsgr.","1. Durchgang",null,null,null,"2. Durchgang",null,null,null,"Volle","Abr.","Ges.","FW",null,null,null,null,null,null,null,null,null,null,null,null,"Name","Ortsgr.","1. Durchgang",null,null,null,"2. Durchgang",null,null,null,"Volle","Abr.","Ges.","FW"]
[null,null,null,null,"V","A","G","FW","V","A","G","FW",null,null,null,null,null,null,null,null,null,null,null,null,null,null,null,null,null,null,"V","A","G","FW","V","A","G","FW"]
[1,136,"Grassmugg Josef","Koblach",86,53,139,0,95,51,146,0,181,104,285,0,null,null,null,null,null,null,null,null,null,null,1,184,{"$f":"IF($AB$6:$AB$81=\"\",\"\",VLOOKUP($AB$6:$AB$81,Spielerliste!$A$1:$C$480,2))","v":"Heinle Otmar"},{"$f":"IF($AB$6:$AB$81=\"\",\"\",VLOOKUP($AB$6:$AB$81,Spielerliste!$A$1:$C$480,3))","v":"Mäder"},54,{"$f":"AG6-AE6","v":35},89,8,67,{"$f":"AK6-AI6","v":25},92,6,{"$f":"AE6+AI6","v":121},{"$f":"AF6+AJ6","v":60},{"$f":"AG6+AK6","v":181},{"$f":"AH6+AL6","v":14}]
[2,111,"Cuk Jure","Hohenems",95,53,148,0,87,36,123,3,182,89,271,3,null,null,null,null,null,null,null,null,null,null,2,188,{"$f":"IF($AB$6:$AB$81=\"\",\"\",VLOOKUP($AB$6:$AB$81,Spielerliste!$A$1:$C$480,2))","v":"Riedmann Wolfgang"},{"$f":"IF($AB$6:$AB$81=\"\",\"\",VLOOKUP($AB$6:$AB$81,Spielerliste!$A$1:$C$480,3))","v":"Mäder"},71,26,97,6,78,52,130,0,149,78,227,6]
[3,174,"Riedmann Werner","Lustenau",91,43,134,4,91,45,136,0,182,88,270,4,null,null,null,null,null,null,null,null,null,null,3,85,{"$f":"IF($AB$6:$AB$81=\"\",\"\",VLOOKUP($AB$6:$AB$81,Spielerliste!$A$1:$C$480,2))","v":"Hyden Walter"},{"$f":"IF($AB$6:$AB$81=\"\",\"\",VLOOKUP($AB$6:$AB$81,Spielerliste!$A$1:$C$480,3))","v":"Götzis"},87,27,114,4,87,41,128,1,174,68,242,5]
[4,146,"Nikolic Milosav","Koblach",91,44,135,1,86,44,130,2,177,88,265,3,null,null,null,null,null,null,null,null,null,null,4,90,{"$f":"IF($AB$6:$AB$81=\"\",\"\",VLOOKUP($AB$6:$AB$81,Spielerliste!$A$1:$C$480,2))","v":"Scherz Ernst"},{"$f":"IF($AB$6:$AB$81=\"\",\"\",VLOOKUP($AB$6:$AB$81,Spielerliste!$A$1:$C$480,3))","v":"Götzis"},86,25,111,7,77,35,112,5,163,60,223,12]
[5,46,"Kessler Günter","Dornbirn",87,36,123,2,87,51,138,2,174,87,261,4,null,null,null,null,null,null,null,null,null,null,5,292,{"$f":"IF($AB$6:$AB$81=\"\",\"\",VLOOKUP($AB$6:$AB$81,Spielerliste!$A$1:$C$480,2))","v":"Munz Karl"},{"$f":"IF($AB$6:$AB$81=\"\",\"\",VLOOKUP($AB$6:$AB$81,Spielerliste!$A$1:$C$480,3))","v":"Partenen"},70,17,87,6,79,25,104,5,149,42,191,11]
[6,87,"Pürstl Richard","Götzis",94,42,136,1,87,35,122,3,181,77,258,4,null,null,null,null,null,null,null,null,null,null,6,294,{"$f":"IF($AB$6:$AB$81=\"\",\"\",VLOOKUP($AB$6:$AB$81,Spielerliste!$A$1:$C$480,2))","v":"Werle Karl"},{"$f":"IF($AB$6:$AB$81=\"\",\"\",VLOOKUP($AB$6:$AB$81,Spielerliste!$A$1:$C$480,3))","v":"Partenen"},83,27,110,4,79,26,105,5,162,53,215,9]
[7,43,"Gradwohl Josef","Dornbirn",86,34,120,2,101,36,137,1,187,70,257,3,null,null,null,null,null,null,null,null,null,null,7,111,{"$f":"IF($AB$6:$AB$81=\"\",\"\",VLOOKUP($AB$6:$AB$81,Spielerliste!$A$1:$C$480,2))","v":"Cuk Jure"},{"$f":"IF($AB$6:$AB$81=\"\",\"\",VLOOKUP($AB$6:$AB$81,Spielerliste!$A$1:$C$480,3))","v":"Hohenems"},95,53,148,0,87,36,123,3,182,89,271,3]
[8,220,"Schirgi Wolfgang","Rankweil",80,61,141,2,81,34,115,2,161,95,256,4,null,null,null,null,null,null,null,null,null,null,8,134,{"$f":"IF($AB$6:$AB$81=\"\",\"\",VLOOKUP($AB$6:$AB$81,Spielerliste!$A$1:$C$480,2))","v":"Fessler Gerd"},{"$f":"IF($AB$6:$AB$81=\"\",\"\",VLOOKUP($AB$6:$AB$81,Spielerliste!$A$1:$C$480,3))","v":"Koblach"},92,35,127,1,93,35,128,0,185,70,255,1]
[9,199,"Paulitsch Gottfried","Nofels",87,33,120,3,86,50,136,0,173,83,256,3,null,null,null,null,null,null,null,null,null,null,9,136,{"$f":"IF($AB$6:$AB$81=\"\",\"\",VLOOKUP($AB$6:$AB$81,Spielerliste!$A$1:$C$480,2))","v":"Grassmugg Josef"},{"$f":"IF($AB$6:$AB$81=\"\",\"\",VLOOKUP($AB$6:$AB$81,Spielerliste!$A$1:$C$480,3))","v":"Koblach"},86,53,139,0,95,51,146,0,181,104,285,0]
[10,134,"Fessler Gerd","Koblach",92,35,127,1,93,35,128,0,185,70,255,1,null,null,null,null,null,null,null,null,null,null,10,252,{"$f":"IF($AB$6:$AB$81=\"\",\"\",VLOOKUP($AB$6:$AB$81,Spielerliste!$A$1:$C$480,2))","v":"Maier Wilfried"},{"$f":"IF($AB$6:$AB$81=\"\",\"\",VLOOKUP($AB$6:$AB$81,Spielerliste!$A$1:$C$480,3))","v":"Vandans"},77,27,104,4,88,50,138,0,165,77,242,4]
[11,82,"Einwaller Harald","Götzis",82,41,123,0,89,42,131,0,171,83,254,0,null,null,null,null,null,null,null,null,null,null,11,38,{"$f":"IF($AB$6:$AB$81=\"\",\"\",VLOOKUP($AB$6:$AB$81,Spielerliste!$A$1:$C$480,2))","v":"Berger Reinhard"},{"$f":"IF($AB$6:$AB$81=\"\",\"\",VLOOKUP($AB$6:$AB$81,Spielerliste!$A$1:$C$480,3))","v":"Dornbirn"},85,26,111,3,84,52,136,1,169,78,247,4]
[12,200,"Peterlunger Valerian","Nofels",81,44,125,1,84,43,127,2,165,87,252,3,null,null,null,null,null,null,null,null,null,null,12,256,{"$f":"IF($AB$6:$AB$81=\"\",\"\",VLOOKUP($AB$6:$AB$81,Spielerliste!$A$1:$C$480,2))","v":"Simenowskyj Stefan"},{"$f":"IF($AB$6:$AB$81=\"\",\"\",VLOOKUP($AB$6:$AB$81,Spielerliste!$A$1:$C$480,3))","v":"Vandans"},67,34,101,4,75,42,117,3,142,76,218,7]
[13,47,"Kezic Blago","Dornbirn",92,35,127,2,82,42,124,2,174,77,251,4,null,null,null,null,null,null,null,null,null,null,13,258,{"$f":"IF($AB$6:$AB$81=\"\",\"\",VLOOKUP($AB$6:$AB$81,Spielerliste!$A$1:$C$480,2))","v":"Ströhle Helmut"},{"$f":"IF($AB$6:$AB$81=\"\",\"\",VLOOKUP($AB$6:$AB$81,Spielerliste!$A$1:$C$480,3))","v":"Vandans"},88,26,114,3,79,27,106,1,167,53,220,4]
[14,198,"Mair Otmar","Nofels",87,34,121,2,94,35,129,2,181,69,250,4,null,null,null,null,null,null,null,null,null,null,14,259,{"$f":"IF($AB$6:$AB$81=\"\",\"\",VLOOKUP($AB$6:$AB$81,Spielerliste!$A$1:$C$480,2))","v":"Trummer Heinz"},{"$f":"IF($AB$6:$AB$81=\"\",\"\",VLOOKUP($AB$6:$AB$81,Spielerliste!$A$1:$C$480,3))","v":"Vandans"},71,35,106,5,75,25,100,7,146,60,206,12]
[15,38,"Berger Reinhard","Dornbirn",85,26,111,3,84,52,136,1,169,78,247,4,null,null,null,null,null,null,null,null,null,null,15,261,{"$f":"IF($AB$6:$AB$81=\"\",\"\",VLOOKUP($AB$6:$AB$81,Spielerliste!$A$1:$C$480,2))","v":"Wachter Robert"},{"$f":"IF($AB$6:$AB$81=\"\",\"\",VLOOKUP($AB$6:$AB$81,Spielerliste!$A$1:$C$480,3))","v":"Vandans"},100,25,125,5,63,26,89,5,163,51,214,10]
{"$rows_left_out":41}
{"sheet":"EM 60 Wurf Herren 2","index":2,"n_rows":65,"n_cols":42,"rows_kept":65,"cut":false,"hidden":false,"merged":[[3,27,4,27],[0,0,0,15],[0,26,0,41],[1,0,1,15],[1,26,1,41],[3,0,4,0],[3,1,4,1],[3,2,4,2],[3,3,4,3],[3,4,3,7],[3,8,3,11],[3,12,4,12],[3,13,4,13],[3,14,4,14],[3,15,4,15],[3,26,4,26],[3,40,4,40],[3,41,4,41],[3,28,4,28],[3,29,4,29],[3,30,3,33],[3,34,3,37],[3,38,4,38],[3,39,4,39]]}
["60 Wurf - Einzelmeisterschaft  2019/20",null,null,null,null,null,null,null,null,null,null,null,null,null,null,null,null,null,null,null,null,null,null,null,null,null,"Einzelmeisterschaft  2019/20"]
["Ergebnisliste - HERREN 2",null,null,null,null,null,null,null,null,null,null,null,null,null,null,null,null,null,null,null,null,null,null,null,null,null,"Ergebnisliste - HERREN 2"]
[]
["Pl.",null,"Name","Ortsgr.","1. Durchgang",null,null,null,"2. Durchgang",null,null,null,"Volle","Abr.","Ges.","FW",null,null,null,null,null,null,null,null,null,null,"Pl.",null,"Name","Ortsgr.","1. Durchgang",null,null,null,"2. Durchgang",null,null,null,"Volle","Abr.","Ges.","FW"]
[null,null,null,null,"V","A","G","FW","V","A","G","FW",null,null,null,null,null,null,null,null,null,null,null,null,null,null,null,null,null,null,"V","A","G","FW","V","A","G","FW"]
[1,117,"Prugg Franz","Hohenems",91,52,143,0,86,41,127,3,177,93,270,3,null,null,null,null,null,null,null,null,null,null,1,172,{"$f":"IF($AB$6:$AB$80=\"\",\"\",VLOOKUP($AB$6:$AB$80,Spielerliste!$A$1:$C$480,2))","v":"Millien Karl"},{"$f":"IF($AB$6:$AB$80=\"\",\"\",VLOOKUP($AB$6:$AB$80,Spielerliste!$A$1:$C$480,3))","v":"Lustenau"},68,{"$f":"AG6-AE6","v":36},104,4,75,{"$f":"AK6-AI6","v":18},93,8,{"$f":"AE6+AI6","v":143},54,197,12]
[2,148,"Schatzer Günther","Koblach",85,54,139,1,95,35,130,1,180,89,269,2,null,null,null,null,null,null,null,null,null,null,2,101,{"$f":"IF($AB$6:$AB$80=\"\",\"\",VLOOKUP($AB$6:$AB$80,Spielerliste!$A$1:$C$480,2))","v":"Prutsch Franz"},{"$f":"IF($AB$6:$AB$80=\"\",\"\",VLOOKUP($AB$6:$AB$80,Spielerliste!$A$1:$C$480,3))","v":"Hard"},84,37,121,1,76,34,110,4,160,71,231,5]
[3,267,"Bischelsberger Helmut","Wolfurt",85,53,138,2,85,44,129,2,170,97,267,4,null,null,null,null,null,null,null,null,null,null,3,39,{"$f":"IF($AB$6:$AB$80=\"\",\"\",VLOOKUP($AB$6:$AB$80,Spielerliste!$A$1:$C$480,2))","v":"Berthold Alfons"},{"$f":"IF($AB$6:$AB$80=\"\",\"\",VLOOKUP($AB$6:$AB$80,Spielerliste!$A$1:$C$480,3))","v":"Dornbirn"},76,43,119,2,82,43,125,2,158,86,244,4]
[4,31,"Voltolini Siegfried","Bürs",88,42,130,0,99,33,132,4,187,75,262,4,null,null,null,null,null,null,null,null,null,null,4,55,{"$f":"IF($AB$6:$AB$80=\"\",\"\",VLOOKUP($AB$6:$AB$80,Spielerliste!$A$1:$C$480,2))","v":"Winder Josef"},{"$f":"IF($AB$6:$AB$80=\"\",\"\",VLOOKUP($AB$6:$AB$80,Spielerliste!$A$1:$C$480,3))","v":"Dornbirn"},83,34,117,3,78,36,114,3,161,70,231,6]
[5,275,"Wolf Othmar","Wolfurt",97,33,130,2,90,42,132,3,187,75,262,5,null,null,null,null,null,null,null,null,null,null,5,null,{"$f":"IF($AB$6:$AB$80=\"\",\"\",VLOOKUP($AB$6:$AB$80,Spielerliste!$A$1:$C$480,2))","v":""},{"$f":"IF($AB$6:$AB$80=\"\",\"\",VLOOKUP($AB$6:$AB$80,Spielerliste!$A$1:$C$480,3))","v":""},null,0,null,null,null,0,null,null,0,0,0,0]
[6,27,"Scherrer Martin","Bürs",87,45,132,3,84,45,129,0,171,90,261,3,null,null,null,null,null,null,null,null,null,null,6,291,{"$f":"IF($AB$6:$AB$80=\"\",\"\",VLOOKUP($AB$6:$AB$80,Spielerliste!$A$1:$C$480,2))","v":"Klinger Franz"},{"$f":"IF($AB$6:$AB$80=\"\",\"\",VLOOKUP($AB$6:$AB$80,Spielerliste!$A$1:$C$480,3))","v":"Partenen"},74,24,98,5,77,25,102,6,151,49,200,11]
[7,69,"Rüscher Kolumban","Feldkirch",87,43,130,1,86,44,130,2,173,87,260,3,null,null,null,null,null,null,null,null,null,null,7,293,{"$f":"IF($AB$6:$AB$80=\"\",\"\",VLOOKUP($AB$6:$AB$80,Spielerliste!$A$1:$C$480,2))","v":"Pachole Bruno"},{"$f":"IF($AB$6:$AB$80=\"\",\"\",VLOOKUP($AB$6:$AB$80,Spielerliste!$A$1:$C$480,3))","v":"Partenen"},71,42,113,2,76,25,101,4,147,67,214,6]
[8,62,"Fink Reinold","Feldkirch",87,43,130,3,95,35,130,2,182,78,260,5,null,null,null,null,null,null,null,null,null,null,8,115,{"$f":"IF($AB$6:$AB$80=\"\",\"\",VLOOKUP($AB$6:$AB$80,Spielerliste!$A$1:$C$480,2))","v":"Mitteregger Herbert"},{"$f":"IF($AB$6:$AB$80=\"\",\"\",VLOOKUP($AB$6:$AB$80,Spielerliste!$A$1:$C$480,3))","v":"Hohenems"},82,53,135,1,81,34,115,1,163,87,250,2]
[9,212,"Ender Helmut","Rankweil",90,45,135,0,70,51,121,0,160,96,256,0,null,null,null,null,null,null,null,null,null,null,9,247,{"$f":"IF($AB$6:$AB$80=\"\",\"\",VLOOKUP($AB$6:$AB$80,Spielerliste!$A$1:$C$480,2))","v":"Bodingbauer Herbert"},{"$f":"IF($AB$6:$AB$80=\"\",\"\",VLOOKUP($AB$6:$AB$80,Spielerliste!$A$1:$C$480,3))","v":"Vandans"},80,16,96,10,73,26,99,3,153,42,195,13]
[10,133,"Egle Norbert","Koblach",92,45,137,0,81,34,115,1,173,79,252,1,null,null,null,null,null,null,null,null,null,null,10,248,{"$f":"IF($AB$6:$AB$80=\"\",\"\",VLOOKUP($AB$6:$AB$80,Spielerliste!$A$1:$C$480,2))","v":"Bolter Manfred"},{"$f":"IF($AB$6:$AB$80=\"\",\"\",VLOOKUP($AB$6:$AB$80,Spielerliste!$A$1:$C$480,3))","v":"Vandans"},80,18,98,6,79,44,123,1,159,62,221,7]
[11,40,"Ehgartner Wolfgang","Dornbirn",95,33,128,3,82,41,123,0,177,74,251,3,null,null,null,null,null,null,null,null,null,null,11,249,{"$f":"IF($AB$6:$AB$80=\"\",\"\",VLOOKUP($AB$6:$AB$80,Spielerliste!$A$1:$C$480,2))","v":"Egle Herbert"},{"$f":"IF($AB$6:$AB$80=\"\",\"\",VLOOKUP($AB$6:$AB$80,Spielerliste!$A$1:$C$480,3))","v":"Vandans"},76,36,112,3,85,36,121,2,161,72,233,5]
[12,115,"Mitteregger Herbert","Hohenems",82,53,135,1,81,34,115,1,163,87,250,2,null,null,null,null,null,null,null,null,null,null,12,251,{"$f":"IF($AB$6:$AB$80=\"\",\"\",VLOOKUP($AB$6:$AB$80,Spielerliste!$A$1:$C$480,2))","v":"Kleboth Günther"},{"$f":"IF($AB$6:$AB$80=\"\",\"\",VLOOKUP($AB$6:$AB$80,Spielerliste!$A$1:$C$480,3))","v":"Vandans"},68,34,102,3,63,18,81,9,131,52,183,12]
[13,29,"Thönig Gilbert","Bürs",87,43,130,1,82,35,117,3,169,78,247,4,null,null,null,null,null,null,null,null,null,null,13,117,{"$f":"IF($AB$6:$AB$80=\"\",\"\",VLOOKUP($AB$6:$AB$80,Spielerliste!$A$1:$C$480,2))","v":"Prugg Franz"},{"$f":"IF($AB$6:$AB$80=\"\",\"\",VLOOKUP($AB$6:$AB$80,Spielerliste!$A$1:$C$480,3))","v":"Hohenems"},91,52,143,0,86,41,127,3,177,93,270,3]
[14,39,"Berthold Alfons","Dornbirn",76,43,119,2,82,43,125,2,158,86,244,4,null,null,null,null,null,null,null,null,null,null,14,253,{"$f":"IF($AB$6:$AB$80=\"\",\"\",VLOOKUP($AB$6:$AB$80,Spielerliste!$A$1:$C$480,2))","v":"Nägele Anton"},{"$f":"IF($AB$6:$AB$80=\"\",\"\",VLOOKUP($AB$6:$AB$80,Spielerliste!$A$1:$C$480,3))","v":"Vandans"},83,27,110,5,94,26,120,5,177,53,230,10]
[15,281,"Brichaz Franz","ESV Br-Wo",83,36,119,2,83,41,124,0,166,77,243,2,null,null,null,null,null,null,null,null,null,null,15,133,{"$f":"IF($AB$6:$AB$80=\"\",\"\",VLOOKUP($AB$6:$AB$80,Spielerliste!$A$1:$C$480,2))","v":"Egle Norbert"},{"$f":"IF($AB$6:$AB$80=\"\",\"\",VLOOKUP($AB$6:$AB$80,Spielerliste!$A$1:$C$480,3))","v":"Koblach"},92,45,137,0,81,34,115,1,173,79,252,1]
{"$rows_left_out":46}
{"sheet":"Spielerliste","index":3,"n_rows":481,"n_cols":11,"rows_kept":481,"cut":false,"hidden":true,"merged":[]}
["00:00:00","2019-10-22"]
[1,"Bertsch Gerhard","Bludenz","1957-03-01",{"$f":"LEFT(C2,2)","v":"Bl"},{"$f":"YEAR(D2)","v":1957},2019,"H1","","Bertsch Gerhard H1","Bertsch Gerhard H1"]
[2,"Grundner Adolf","Bludenz","1938-03-31","Bl",{"$f":"YEAR(D3)","v":1938},2019,"","H2","Grundner Adolf H2","Grundner Adolf H2"]
[3,"Battisti Anton","Bludenz","1951-01-02","Bl",{"$f":"YEAR(D4)","v":1951},2019,"H1","","Battisti Anton H1","Battisti Anton H1"]
[4,"Schöner Kurt","Bludenz","1938-12-31","Bl",{"$f":"YEAR(D5)","v":1938},2019,"","H2","Schöner Kurt H2","Schöner Kurt H2"]
[5,"Pröckl Heinrich","Bludenz","1931-10-12","Bl",{"$f":"YEAR(D6)","v":1931},2019,"","H2","Pröckl Heinrich H2","Pröckl Heinrich H2"]
[6,null,null,null,"",null,null,null,null,null," "]
[7,null,null,null,"",null,null,null,null,null," "]
[8,null,null,null,"",null,null,null,null,null," "]
[9,null,null,null,"",null,null,null,null,null," "]
[10,null,null,null,"",null,null,null,null,null," "]
[11,"Berkmann Josef","Bregenz","1956-10-07","Br",{"$f":"YEAR(D12)","v":1956},2019,"H1","","Berkmann Josef H1","Berkmann Josef H1"]
[12,"Buggelsheim Kurt","Bregenz","1954-04-18","Br",1954,2019,"H1","","Buggelsheim Kurt H1","Buggelsheim Kurt H1"]
[13,"Cordin Karl Heinz","Bregenz","1940-07-12","Br",1940,2019,"","H2","Cordin Karl Heinz H2","Cordin Karl Heinz H2"]
[14,"Fischer Peter","Bregenz","1951-04-07","Br",1951,2019,"H1","","Fischer Peter H1","Fischer Peter H1"]
[15,"Giesinger Raimund","Bregenz","1951-11-06","Br",1951,2019,"H1","","Giesinger Raimund H1","Giesinger Raimund H1"]
[16,"Natter Helmut","Bregenz","1938-07-19","Br",1938,2019,"","H2","Natter Helmut H2","Natter Helmut H2"]
[17,"Scheiber Martin","Bregenz","1956-02-21","Br",1956,2019,"H1","","Scheiber Martin H1","Scheiber Martin H1"]
[18,"Schwärzler Herbert","Bregenz","1945-01-19","Br",1945,2019,"","H2","Schwärzler Herbert H2","Schwärzler Herbert H2"]
[19,"Stibitzhofer Karl","Bregenz","1941-05-30","Br",1941,2019,"","H2","Stibitzhofer Karl H2","Stibitzhofer Karl H2"]
{"$rows_left_out":462}
{"sheet":"Tabelle1","index":4,"n_rows":5,"n_cols":1,"rows_kept":5,"cut":false,"hidden":true,"merged":[]}
[]
[]
[]
["Neigungsgruppe Kegeln"]
["Einzelmeisterschaft  2012/13"]